{"text_format":"1","workbook":"xlsx","n_sheets":8,"sheets":["記入シート","記入シート (入力見本)","事前①","工事内容証明書（事後)","部位マスタ","商品マスタ","Sheet1","申請書"],"not_rendered":{"charts":0,"images":1,"macros":1,"external_links":0,"defined_names":29,"comments":0,"pivot_tables":0},"unopened":[],"bounds":{"document_bytes":16777216,"sheet_cells":100000,"rows_first":2000,"rows_last":500,"rows_between":2000,"halvings":0,"cell_chars":16384,"cell_head_chars":4096},"cells_cut":0,"cells_raw":0,"read":"whole","date_system":"1900"}

{"sheet":"記入シート","index":0,"n_rows":56,"n_cols":19,"rows_kept":56,"cut":false,"hidden":false,"merged":[[28,11,28,12],[28,3,28,10],[27,3,27,6],[27,7,27,8],[23,3,23,10],[26,4,26,8],[17,3,17,6],[22,11,22,12],[23,11,23,12],[27,11,27,12],[22,9,22,10],[18,3,18,10],[14,2,16,2],[14,9,16,9],[15,4,15,6],[14,4,14,6],[14,7,14,8],[15,7,15,8],[16,4,16,8],[1,2,1,4],[2,2,2,4],[3,2,3,4],[8,1,8,2],[8,3,8,11],[1,6,1,7],[4,2,4,4],[3,5,3,6],[5,1,7,2],[5,4,5,11],[6,4,6,11],[7,4,7,11],[4,5,4,6],[4,7,4,11],[13,1,28,1],[27,9,27,10],[24,7,24,8],[25,4,25,6],[25,7,25,8],[13,2,13,6],[13,7,13,8],[13,9,13,11],[17,7,17,8],[17,9,17,10],[17,11,17,12],[18,11,18,12],[19,4,19,6],[19,7,19,8],[20,4,20,6],[20,7,20,8],[9,1,9,2],[9,3,9,11],[10,1,10,2],[10,3,10,11],[12,1,12,2],[12,3,12,11],[11,1,11,2],[11,3,11,11],[55,1,61,1],[55,2,61,12],[52,2,52,12],[53,2,53,12],[54,2,54,12],[35,1,54,1],[36,2,36,12],[37,2,37,12],[42,2,42,12],[43,2,43,12],[44,2,44,12],[45,2,45,12],[46,2,46,12],[38,2,38,12],[39,2,39,12],[35,2,35,12],[49,2,49,12],[50,2,50,12],[40,2,40,12],[41,2,41,12],[51,2,51,12],[19,2,21,2],[19,9,21,9],[47,2,47,12],[48,2,48,12],[24,2,26,2],[24,9,26,9],[24,4,24,6],[22,3,22,6],[22,7,22,8],[21,4,21,8],[34,2,34,12],[29,2,29,12],[30,2,30,12],[31,2,31,12],[32,2,32,12],[33,2,33,12]]}
[]
[null,"依頼日"]
[null,"販売店名","化研マテリアル株式会社"]
[null,"担当者名",null,null,null,320500]
[null,"出荷証明書","未申請　　申請済み",null,null,"発送方法",null,"PDF　　　　原本発送"]
[null,"保証書送付先",null,"宛先"]
[null,null,null,"住所"]
[null,null,null,"電話番号"]
[null,"宛先"]
[null,"工事名"]
[null,"工事場所(住所)"]
[null,"工期"]
[null,"保証開始日"]
[null,"保証内容\n及び面積","塗装仕様",null,null,null,null,"色名",null,"施工店への出荷缶数",null,null,"CAN使用","基準缶数"]
[null,null,"外壁","上塗",null,null,null,null,null,"使用缶数","上",null,null,{"$f":"IFERROR(ROUNDUP($J$18*R15/S15,0),\"\")","v":""},{"$f":"IF(OR(C15=\"鉄部\", C15=\"鉄部一式\", C15=\"一式\", C15=\"一般鉄部\"), \"\", IF(ISBLANK(L15), \"\", IF(L15 >= N15, \"\", \"※出荷缶数が不足しています\")))","v":""},null,null,{"$f":"IFERROR(VLOOKUP(E15,商品マスタ!$F$3:$H$62,3,0),\"\")","v":""},{"$f":"IFERROR(VLOOKUP(E15,商品マスタ!$F$3:$H$62,2,0),\"\")","v":""}]
[null,null,null,"中塗",null,null,null,null,null,null,"中",null,null,{"$f":"IFERROR(ROUNDUP($J$18*R16/S16,0),\"\")","v":""},{"$f":"IF(OR(C15=\"鉄部\", C15=\"鉄部一式\", C15=\"一式\", C15=\"一般鉄部\"), \"\", IF(ISBLANK(L16), \"\", IF(L16 >= N16, \"\", \"※出荷缶数が不足しています\")))","v":""},null,null,{"$f":"IFERROR(VLOOKUP(E16,商品マスタ!$F$3:$H$62,3,0),\"\")","v":""},{"$f":"IFERROR(VLOOKUP(E16,商品マスタ!$F$3:$H$62,2,0),\"\")","v":""}]
[null,null,null,"下塗",null,null,null,null,null,null,"下",null,null,{"$f":"IFERROR(ROUNDUP($J$18*R17/S17,0),\"\")","v":""},{"$f":"IF(OR(C15=\"鉄部\", C15=\"鉄部一式\", C15=\"一式\", C15=\"一般鉄部\"), \"\", IF(ISBLANK(L17), \"\", IF(L17 >= N17, \"\", \"※出荷缶数が不足しています\")))","v":""},null,null,{"$f":"IFERROR(VLOOKUP(E17,商品マスタ!$B$3:$D$21,3,0),\"\")","v":""},{"$f":"IFERROR(VLOOKUP(E17,商品マスタ!$B$3:$D$21,2,0),\"\")","v":""}]
[null,null,"保証内容","塗膜に著しい剥がれがないこと",null,null,null,"保証面積",null,null,null,"㎡"]
[null,null,"保証年数",null,null,null,null,null,null,null,null,"年"]
[null,null,"天井","上塗",null,null,null,null,null,"使用缶数","上",null,null,{"$f":"IFERROR(ROUNDUP($J$23*R20/S20,0),\"\")","v":""},{"$f":"IF(OR(C20=\"鉄部\", C20=\"鉄部一式\", C20=\"一式\", C20=\"一般鉄部\"), \"\", IF(ISBLANK(L20), \"\", IF(L20 >= N20, \"\", \"※出荷缶数が不足しています\")))","v":""},null,null,{"$f":"IFERROR(VLOOKUP(E20,商品マスタ!$F$3:$H$62,3,0),\"\")","v":""},{"$f":"IFERROR(VLOOKUP(E20,商品マスタ!$F$3:$H$62,2,0),\"\")","v":""}]
[null,null,null,"中塗",null,null,null,null,null,null,"中",null,null,{"$f":"IFERROR(ROUNDUP($J$23*R21/S21,0),\"\")","v":""},{"$f":"IF(OR(C20=\"鉄部\", C20=\"鉄部一式\", C20=\"一式\", C20=\"一般鉄部\"), \"\", IF(ISBLANK(L21), \"\", IF(L21 >= N21, \"\", \"※出荷缶数が不足しています\")))","v":""},null,null,{"$f":"IFERROR(VLOOKUP(E21,商品マスタ!$F$3:$H$62,3,0),\"\")","v":""},{"$f":"IFERROR(VLOOKUP(E21,商品マスタ!$F$3:$H$62,2,0),\"\")","v":""}]
[null,null,null,"下塗",null,null,null,null,null,null,"下",null,null,{"$f":"IFERROR(ROUNDUP($J$23*R22/S22,0),\"\")","v":""},{"$f":"IF(OR(C20=\"鉄部\", C20=\"鉄部一式\", C20=\"一式\", C20=\"一般鉄部\"), \"\", IF(ISBLANK(L22), \"\", IF(L22 >= N22, \"\", \"※出荷缶数が不足しています\")))","v":""},null,null,{"$f":"IFERROR(VLOOKUP(E22,商品マスタ!$B$3:$D$21,3,0),\"\")","v":""},{"$f":"IFERROR(VLOOKUP(E22,商品マスタ!$B$3:$D$21,2,0),\"\")","v":""}]
[null,null,"保証内容","塗膜に著しい剥がれがないこと",null,null,null,"保証面積",null,null,null,"㎡"]
[null,null,"保証年数",null,null,null,null,null,null,null,null,"年"]
[null,null,"鉄部","上塗",null,null,null,null,null,"使用缶数","上",null,null,{"$f":"IFERROR(ROUNDUP($J$28*R25/S25,0),\"\")","v":""},{"$f":"IF(OR(C25=\"鉄部\", C25=\"鉄部一式\", C25=\"一式\", C25=\"一般鉄部\"), \"\", IF(ISBLANK(L25), \"\", IF(L25 >= N25, \"\", \"※出荷缶数が不足しています\")))","v":""},null,null,{"$f":"IFERROR(VLOOKUP(E25,商品マスタ!$F$3:$H$62,3,0),\"\")","v":""},{"$f":"IFERROR(VLOOKUP(E25,商品マスタ!$F$3:$H$62,2,0),\"\")","v":""}]
[null,null,null,"中塗",null,null,null,null,null,null,"中",null,null,{"$f":"IFERROR(ROUNDUP($J$28*R26/S26,0),\"\")","v":""},{"$f":"IF(OR(C25=\"鉄部\", C25=\"鉄部一式\", C25=\"一式\", C25=\"一般鉄部\"), \"\", IF(ISBLANK(L26), \"\", IF(L26 >= N26, \"\", \"※出荷缶数が不足しています\")))","v":""},null,null,{"$f":"IFERROR(VLOOKUP(E26,商品マスタ!$F$3:$H$62,3,0),\"\")","v":""},{"$f":"IFERROR(VLOOKUP(E26,商品マスタ!$F$3:$H$62,2,0),\"\")","v":""}]
[null,null,null,"下塗",null,null,null,null,null,null,"下",null,null,{"$f":"IFERROR(ROUNDUP($J$28*R27/S27,0),\"\")","v":""},{"$f":"IF(OR(C25=\"鉄部\", C25=\"鉄部一式\", C25=\"一式\", C25=\"一般鉄部\"), \"\", IF(ISBLANK(L27), \"\", IF(L27 >= N27, \"\", \"※出荷缶数が不足しています\")))","v":""},null,null,{"$f":"IFERROR(VLOOKUP(E27,商品マスタ!$B$3:$D$21,3,0),\"\")","v":""},{"$f":"IFERROR(VLOOKUP(E27,商品マスタ!$B$3:$D$21,2,0),\"\")","v":""}]
[null,null,"保証内容","塗膜に著しい剥がれがないこと",null,null,null,"保証面積",null,null,null,"㎡"]
[null,null,"保証年数",null,null,null,null,null,null,null,null,"年"]
[null,"元請会社名"]
{"$rows_left_out":27}
{"sheet":"記入シート (入力見本)","index":1,"n_rows":75,"n_cols":19,"rows_kept":75,"cut":false,"hidden":false,"merged":[[1,2,1,4],[1,6,1,7],[2,2,2,4],[3,2,3,4],[3,5,3,6],[5,1,7,2],[5,4,5,11],[6,4,6,11],[7,4,7,11],[4,2,4,4],[4,5,4,6],[4,7,4,11],[12,1,12,2],[12,3,12,11],[8,1,8,2],[8,3,8,11],[9,1,9,2],[9,3,9,11],[10,1,10,2],[10,3,10,11],[11,1,11,2],[11,3,11,11],[13,1,28,1],[13,2,13,6],[13,7,13,8],[13,9,13,11],[14,2,16,2],[14,4,14,6],[14,7,14,8],[14,9,16,9],[15,4,15,6],[15,7,15,8],[16,4,16,8],[17,3,17,6],[17,7,17,8],[17,9,17,10],[17,11,17,12],[19,2,21,2],[18,3,18,10],[18,11,18,12],[22,3,22,6],[22,7,22,8],[22,9,22,10],[22,11,22,12],[19,4,19,6],[19,7,19,8],[19,9,21,9],[20,4,20,6],[20,7,20,8],[21,4,21,8],[27,3,27,6],[27,7,27,8],[27,9,27,10],[27,11,27,12],[28,3,28,10],[28,11,28,12],[23,3,23,10],[23,11,23,12],[24,2,26,2],[24,4,24,6],[24,7,24,8],[24,9,26,9],[25,4,25,6],[25,7,25,8],[26,4,26,8],[29,2,29,12],[30,2,30,12],[31,2,31,12],[32,2,32,12],[33,2,33,12],[34,2,34,12],[74,1,80,1],[74,2,80,12],[51,2,51,12],[52,2,52,12],[53,2,53,12],[54,2,54,12],[35,1,54,1],[36,2,36,12],[37,2,37,12],[38,2,38,12],[39,2,39,12],[40,2,40,12],[41,2,41,12],[42,2,42,12],[43,2,43,12],[49,2,49,12],[50,2,50,12],[35,2,35,12],[44,2,44,12],[45,2,45,12],[46,2,46,12],[47,2,47,12],[48,2,48,12]]}
[]
[null,"依頼日","2024/**月/**日"]
[null,"販売店名","〇〇塗料"]
[null,"担当者名","ニッペ"]
[null,"出荷証明書","未申請　　申請済み",null,null,"発送方法",null,"PDF　　　　原本発送"]
[null,"保証書送付先",null,"宛先","株式会社〇〇〇〇　〇〇支店"]
[null,null,null,"住所","〒000-0000 ○○県○○市○○町"]
[null,null,null,"電話番号"," 000-000-0000"]
[null,"宛先",null,"〇〇マンション管理組合"]
[null,"工事名",null,"〇〇マンション大規模修繕工事"]
[null,"工事場所(住所)",null,"〇〇県〇〇市〇〇町＊＊＊＊"]
[null,"工期",null,"2024/**月/**日 ～　2024/**月/**日 "]
[null,"保証開始日",null,"2024/**月/**日 "]
[null,"保証内容\n及び面積","塗装仕様",null,null,null,null,"色名",null,"施工店への出荷缶数",null,null,"CAN使用","基準缶数"]
[null,null,"外壁","上塗","オーデフレッシュＳｉ１００Ⅲ",null,null,"L22-80B",null,"使用缶数","上",32,"✓",{"$f":"IFERROR(ROUNDUP($J$18*R15/S15,0),\"\")","v":32},{"$f":"IF(OR(C15=\"鉄部\", C15=\"鉄部一式\", C15=\"一式\", C15=\"一般鉄部\"), \"\", IF(ISBLANK(L15), \"\", IF(L15 >= N15, \"\", \"※出荷缶数が不足しています\")))","v":""},null,null,{"$f":"IFERROR(VLOOKUP(E15,商品マスタ!$F$3:$H$62,3,0),\"\")","v":0.14000000000000001},{"$f":"IFERROR(VLOOKUP(E15,商品マスタ!$F$3:$H$62,2,0),\"\")","v":15}]
[null,null,null,"中塗","オーデフレッシュＳｉ１００Ⅲ",null,null,"L22-80B",null,null,"中",32,"✓",{"$f":"IFERROR(ROUNDUP($J$18*R16/S16,0),\"\")","v":32},{"$f":"IF(OR(C15=\"鉄部\", C15=\"鉄部一式\", C15=\"一式\", C15=\"一般鉄部\"), \"\", IF(ISBLANK(L16), \"\", IF(L16 >= N16, \"\", \"※出荷缶数が不足しています\")))","v":""},null,null,{"$f":"IFERROR(VLOOKUP(E16,商品マスタ!$F$3:$H$62,3,0),\"\")","v":0.14000000000000001},{"$f":"IFERROR(VLOOKUP(E16,商品マスタ!$F$3:$H$62,2,0),\"\")","v":15}]
[null,null,null,"下塗","アンダーフィラー弾性エクセル",null,null,null,null,null,"下",65,null,{"$f":"IFERROR(ROUNDUP($J$18*R17/S17,0),\"\")","v":64},{"$f":"IF(OR(C15=\"鉄部\", C15=\"鉄部一式\", C15=\"一式\", C15=\"一般鉄部\"), \"\", IF(ISBLANK(L17), \"\", IF(L17 >= N17, \"\", \"※出荷缶数が不足しています\")))","v":""},null,null,{"$f":"IFERROR(VLOOKUP(E17,商品マスタ!$B$3:$D$21,3,0),\"\")","v":0.3},{"$f":"IFERROR(VLOOKUP(E17,商品マスタ!$B$3:$D$21,2,0),\"\")","v":16}]
[null,null,"保証内容","剥離",null,null,null,"保証面積",null,3400,null,"㎡"]
[null,null,"保証年数",5,null,null,null,null,null,null,null,"年"]
[null,null,"天井","上塗","水性ケンエース",null,null,"LN-90",null,"使用缶数","上",8,"✓",{"$f":"IFERROR(ROUNDUP($J$23*R20/S20,0),\"\")","v":8},{"$f":"IF(OR(C20=\"鉄部\", C20=\"鉄部一式\", C20=\"一式\", C20=\"一般鉄部\"), \"\", IF(ISBLANK(L20), \"\", IF(L20 >= N20, \"\", \"※出荷缶数が不足しています\")))","v":""},null,null,{"$f":"IFERROR(VLOOKUP(E20,商品マスタ!$F$3:$H$60,3,0),\"\")","v":0.12},{"$f":"IFERROR(VLOOKUP(E20,商品マスタ!$F$3:$H$60,2,0),\"\")","v":16}]
[null,null,null,"中塗","水性ケンエース",null,null,"LN-90",null,null,"中",8,"✓",{"$f":"IFERROR(ROUNDUP($J$23*R21/S21,0),\"\")","v":8},{"$f":"IF(OR(C20=\"鉄部\", C20=\"鉄部一式\", C20=\"一式\", C20=\"一般鉄部\"), \"\", IF(ISBLANK(L21), \"\", IF(L21 >= N21, \"\", \"※出荷缶数が不足しています\")))","v":""},null,null,{"$f":"IFERROR(VLOOKUP(E21,商品マスタ!$F$3:$H$60,3,0),\"\")","v":0.12},{"$f":"IFERROR(VLOOKUP(E21,商品マスタ!$F$3:$H$60,2,0),\"\")","v":16}]
[null,null,null,"下塗","水性カチオンシーラー",null,null,null,null,null,"下",8,null,{"$f":"IFERROR(ROUNDUP($J$23*R22/S22,0),\"\")","v":7},{"$f":"IF(OR(C20=\"鉄部\", C20=\"鉄部一式\", C20=\"一式\", C20=\"一般鉄部\"), \"\", IF(ISBLANK(L22), \"\", IF(L22 >= N22, \"\", \"※出荷缶数が不足しています\")))","v":""},null,null,{"$f":"IFERROR(VLOOKUP(E22,商品マスタ!$B$3:$D$21,3,0),\"\")","v":0.1},{"$f":"IFERROR(VLOOKUP(E22,商品マスタ!$B$3:$D$21,2,0),\"\")","v":15}]
[null,null,"保証内容","剥離",null,null,null,"保証面積",null,1000,null,"㎡"]
[null,null,"保証年数",2,null,null,null,null,null,null,null,"年"]
[null,null,"鉄部一式","上塗","ファインウレタンＵ１００",null,null,"L22-80B",null,"使用缶数","上",8,"✓",{"$f":"IFERROR(ROUNDUP($J$28*R25/S25,0),\"\")","v":""},{"$f":"IF(OR(C25=\"鉄部\", C25=\"鉄部一式\", C25=\"一式\", C25=\"一般鉄部\"), \"\", IF(ISBLANK(L25), \"\", IF(L25 >= N25, \"\", \"※出荷缶数が不足しています\")))","v":""},null,null,{"$f":"IFERROR(VLOOKUP(E25,商品マスタ!$F$3:$H$60,3,0),\"\")","v":0.12},{"$f":"IFERROR(VLOOKUP(E25,商品マスタ!$F$3:$H$60,2,0),\"\")","v":15}]
[null,null,null,"中塗","ファインウレタンＵ１００",null,null,"L22-80B",null,null,"中",8,"✓",{"$f":"IFERROR(ROUNDUP($J$28*R26/S26,0),\"\")","v":""},{"$f":"IF(OR(C25=\"鉄部\", C25=\"鉄部一式\", C25=\"一式\", C25=\"一般鉄部\"), \"\", IF(ISBLANK(L26), \"\", IF(L26 >= N26, \"\", \"※出荷缶数が不足しています\")))","v":""},null,null,{"$f":"IFERROR(VLOOKUP(E26,商品マスタ!$F$3:$H$60,3,0),\"\")","v":0.12},{"$f":"IFERROR(VLOOKUP(E26,商品マスタ!$F$3:$H$60,2,0),\"\")","v":15}]
[null,null,null,"下塗","ハイポンファインプライマーⅡ",null,null,null,null,null,"下",10,null,{"$f":"IFERROR(ROUNDUP($J$28*R27/S27,0),\"\")","v":""},{"$f":"IF(OR(C25=\"鉄部\", C25=\"鉄部一式\", C25=\"一式\", C25=\"一般鉄部\"), \"\", IF(ISBLANK(L27), \"\", IF(L27 >= N27, \"\", \"※出荷缶数が不足しています\")))","v":""},null,null,{"$f":"IFERROR(VLOOKUP(E27,商品マスタ!$B$3:$D$21,3,0),\"\")","v":0.16},{"$f":"IFERROR(VLOOKUP(E27,商品マスタ!$B$3:$D$21,2,0),\"\")","v":16}]
[null,null,"保証内容","剥離",null,null,null,"保証面積",null,"一式",null,"㎡"]
[null,null,"保証年数",2,null,null,null,null,null,null,null,"年"]
[null,"元請会社名","〇〇株式会社"]
{"$rows_left_out":46}
{"sheet":"事前①","index":2,"n_rows":53,"n_cols":11,"rows_kept":53,"cut":false,"hidden":true,"merged":[[13,2,13,10],[1,8,1,10],[2,1,2,2],[2,9,2,10],[3,9,3,10],[12,2,12,10],[14,2,14,10],[15,1,44,1],[15,2,17,2],[15,4,15,7],[15,8,17,8],[16,4,16,7],[17,4,17,7],[18,4,18,7],[18,9,18,10],[19,3,19,6],[20,3,20,10],[21,2,23,2],[21,4,21,7],[21,8,23,8],[22,4,22,7],[23,4,23,7],[24,4,24,7],[24,9,24,10],[25,3,25,6],[26,3,26,10],[27,2,29,2],[27,4,27,7],[27,8,29,8],[28,4,28,7],[29,4,29,7],[30,4,30,7],[30,9,30,10],[31,3,31,6],[32,3,32,10],[33,2,35,2],[33,4,33,7],[33,8,35,8],[34,4,34,7],[35,4,35,7],[47,2,47,10],[36,4,36,7],[36,9,36,10],[37,3,37,6],[38,3,38,10],[39,2,41,2],[39,4,39,7],[39,8,41,8],[40,4,40,7],[41,4,41,7],[42,4,42,7],[42,9,42,10],[43,3,43,6],[44,3,44,10],[46,2,46,10],[48,2,48,10],[49,2,49,10],[50,2,50,10],[51,2,51,10],[52,2,52,10]]}
[]
[null,"日本ペイント株式会社",null,null,null,null,null,null,{"$f":"IF(記入シート!C2=\"\",\"\",記入シート!C2)","v":""}]
[null,"＊＊営業所　御中",null,null,null,null,null,null,"販売店名",{"$f":"IF(記入シート!C3=\"\",\"\",記入シート!C3)","v":"化研マテリアル株式会社"}]
[null,null,null,null,null,null,null,null,"担当者名",{"$f":"IF(記入シート!C4=\"\",\"\",記入シート!C4)","v":""}]
[null,"　※出荷証明書不必要の場合は、工事完了後に工事内容証明書にご記載ください。"]
[]
[null,"保　証　書　発　行　事　前　申　請　書"]
[]
[null,null,null,null,null,null,null,null,null,"所長","担当者"]
[]
[]
[null,"※塗装時期/塗装缶数/保証開始日は予定を記載"]
[null,"宛先",{"$f":"IF(記入シート!D9=\"\",\"\",記入シート!D9)","v":""}]
[null,"工事名",{"$f":"IF(記入シート!D10=\"\",\"\",記入シート!D10)","v":""}]
[null,"工事場所",{"$f":"IF(記入シート!D11=\"\",\"\",記入シート!D11)","v":""}]
[null,"保証内容\n及び面積","塗装\n仕様","①上塗：",{"$f":"IF(記入シート!E15=\"\",\"\",記入シート!E15)","v":""},null,null,null,"塗装\n缶数","上塗：",{"$f":"IF(記入シート!L15=\"\",\"\",記入シート!L15)","v":""}]
[null,null,null,"①中塗：",{"$f":"IF(記入シート!E16=\"\",\"\",記入シート!E16)","v":""},null,null,null,null,"中塗：",{"$f":"IF(記入シート!L16=\"\",\"\",記入シート!L16)","v":""}]
[null,null,null,"①下塗：",{"$f":"IF(記入シート!E17=\"\",\"\",記入シート!E17)","v":""},null,null,null,null,"下塗：",{"$f":"IF(記入シート!L17=\"\",\"\",記入シート!L17)","v":""}]
[null,null,"保証部位",{"$f":"記入シート!C15","v":"外壁"},{"$f":"IF(記入シート!D18=\"\",\"\",記入シート!D18)","v":"塗膜に著しい剥がれがないこと"},null,null,null,"塗装時期"]
[null,null,"保証面積",{"$f":"IF(記入シート!J18=\"\",\"\",記入シート!J18)","v":""},null,null,null,"㎡","保証年数",{"$f":"IF(記入シート!D19=\"\",\"\",記入シート!D19)","v":""},"年"]
[null,null,"保証開始日",{"$f":"IF(記入シート!D13=\"\",\"\",記入シート!D13)","v":""}]
[null,null,"塗装\n仕様","①上塗：",{"$f":"IF(記入シート!E20=\"\",\"\",記入シート!E20)","v":""},null,null,null,"塗装\n缶数","上塗：",{"$f":"IF(記入シート!L20=\"\",\"\",記入シート!L20)","v":""}]
[null,null,null,"①中塗：",{"$f":"IF(記入シート!E21=\"\",\"\",記入シート!E21)","v":""},null,null,null,null,"中塗：",{"$f":"IF(記入シート!L21=\"\",\"\",記入シート!L21)","v":""}]
[null,null,null,"①下塗：",{"$f":"IF(記入シート!E22=\"\",\"\",記入シート!E22)","v":""},null,null,null,null,"下塗：",{"$f":"IF(記入シート!L22=\"\",\"\",記入シート!L22)","v":""}]
[null,null,"保証部位",{"$f":"記入シート!C20","v":"天井"},{"$f":"IF(記入シート!D23=\"\",\"\",記入シート!D23)","v":"塗膜に著しい剥がれがないこと"},null,null,null,"塗装時期"]
[null,null,"保証面積",{"$f":"IF(記入シート!J23=\"\",\"\",記入シート!J23)","v":""},null,null,null,"㎡","保証年数",{"$f":"IF(記入シート!D24=\"\",\"\",記入シート!D24)","v":""},"年"]
[null,null,"保証開始日",{"$f":"IF(記入シート!D13=\"\",\"\",記入シート!D13)","v":""}]
[null,null,"塗装\n仕様","①上塗：",{"$f":"IF(記入シート!E25=\"\",\"\",記入シート!E25)","v":""},null,null,null,"塗装\n缶数","上塗：",{"$f":"IF(記入シート!L25=\"\",\"\",記入シート!L25)","v":""}]
[null,null,null,"①中塗：",{"$f":"IF(記入シート!E26=\"\",\"\",記入シート!E26)","v":""},null,null,null,null,"中塗：",{"$f":"IF(記入シート!L26=\"\",\"\",記入シート!L26)","v":""}]
[null,null,null,"①下塗：",{"$f":"IF(記入シート!E27=\"\",\"\",記入シート!E27)","v":""},null,null,null,null,"下塗：",{"$f":"IF(記入シート!L27=\"\",\"\",記入シート!L27)","v":""}]
{"$rows_left_out":24}
{"sheet":"工事内容証明書（事後)","index":3,"n_rows":55,"n_cols":10,"rows_kept":55,"cut":false,"hidden":true,"merged":[[10,7,11,7],[10,8,11,8],[10,9,11,9],[1,8,1,9],[3,0,3,1],[4,2,4,3],[4,8,4,9],[5,8,5,9],[24,0,53,0],[24,1,26,1],[24,3,24,6],[24,7,26,7],[25,3,25,6],[26,3,26,6],[27,2,27,6],[30,1,32,1],[30,3,30,6],[30,7,32,7],[31,3,31,6],[32,3,32,6],[36,1,38,1],[36,3,36,6],[36,7,38,7],[37,3,37,6],[19,1,19,9],[20,1,20,9],[21,1,21,9],[22,1,22,9],[23,1,23,9],[27,8,27,9],[28,2,28,5],[28,7,29,7],[28,8,29,9],[29,2,29,5],[38,3,38,6],[33,8,33,9],[34,2,34,5],[34,7,35,7],[34,8,35,9],[35,2,35,5],[33,2,33,6],[39,2,39,6],[39,8,39,9],[40,2,40,5],[40,7,41,7],[40,8,41,9],[41,2,41,5],[42,1,44,1],[42,3,42,6],[42,7,44,7],[43,3,43,6],[44,3,44,6],[48,1,50,1],[48,3,48,6],[48,7,50,7],[49,3,49,6],[50,3,50,6],[45,8,45,9],[46,2,46,5],[46,7,47,7],[46,8,47,9],[47,2,47,5],[45,2,45,6],[51,2,51,6],[51,8,51,9],[52,2,52,5],[52,7,53,7],[52,8,53,9],[53,2,53,5]]}
[]
["日本ペイント株式会社",null,null,null,null,null,null,null,{"$f":"事前①!I2","v":""}]
[]
[{"$f":"事前①!B3","v":"＊＊営業所　御中"}]
[null,null,"出荷証明書の申請　",null,"有","無",null,"販売店名",{"$f":"IF(記入シート!C3=\"\",\"\",記入シート!C3)","v":"化研マテリアル株式会社"}]
[null,null,null,null,null,null,null,"担当者名",{"$f":"IF(記入シート!C4=\"\",\"\",記入シート!C4)","v":""}]
["※出荷証明書をご依頼頂きました場合は工事内容項目は記入不要です。"]
[]
["工　事　内　容　証　明　書"]
[]
[null,null,null,null,null,null,null,"支店長","所長","担当者"]
[]
["※出荷証明申請書を同時にご依頼頂く場合は当書式への記入は不要となりますが",null,{"$f":"IF(#REF!=\"\",\"\",#REF!)","v":{"$error":"#REF!"}}]
["　必ず出荷証明申請書内の「保証書」項目を「有」とご記入ください。"]
[]
["下記項目は工事終了後に記載"]
["⇒　当該項目記入後に支店長印を捺印し保証書発行を実施"]
["※「●」は事前申請書より内容変更がある場合のみ記載"]
["宛先",{"$f":"事前①!C13","v":""}]
["工事名",{"$f":"事前①!C14","v":""}]
["工事場所",{"$f":"事前①!C15","v":""}]
["施工会社名",{"$f":"事前①!C50","v":""}]
["住　所",{"$f":"事前①!C51","v":""}]
["代表者名",{"$f":"事前①!C52","v":""}]
["工事内容","●塗装\n　仕様","①上塗：",{"$f":"事前①!E16","v":""},null,null,null,"実塗装\n缶数","上塗：",{"$f":"事前①!K16","v":""}]
[null,null,"①中塗：",{"$f":"事前①!E17","v":""},null,null,null,null,"中塗：",{"$f":"事前①!K17","v":""}]
[null,null,"①下塗：",{"$f":"事前①!E18","v":""},null,null,null,null,"下塗：",{"$f":"事前①!K18","v":""}]
[null,"色名",null,null,null,null,null,"出荷月"]
[null,"●保証面積",{"$f":"事前①!D20","v":""},null,null,null,"㎡","他変更点"]
[null,"●保証開始日",{"$f":"事前①!D21","v":""},null,null,null,"より"]
{"$rows_left_out":26}
{"sheet":"部位マスタ","index":4,"n_rows":20,"n_cols":2,"rows_kept":20,"cut":false,"hidden":true,"merged":[]}
[]
[null,"部位"]
[null,"一般外壁"]
[null,"外壁"]
[null,"パラペット"]
[null,"屋根"]
[null,"天井"]
[null,"軒裏"]
[null,"軒天"]
[null,"上裏"]
[null,"鉄部"]
[null,"一般鉄部"]
[null,"一式"]
[null,"鉄部一式"]
[null,"受水槽"]
[null,"貯水槽"]
[null,"竪樋"]
[null,"隔板"]
[null,"パーテーションボード"]
[null,"玄関扉枠"]

{"sheet":"商品マスタ","index":5,"n_rows":64,"n_cols":8,"rows_kept":64,"cut":false,"hidden":false,"merged":[]}
[]
[null,"下塗","1斗缶容量","塗布量(minimum)",null,"中塗・上塗","1斗缶容量","塗布量(minimum)"]
[null,"水性カチオンシーラー",15,0.1]
[null,"ファイン浸透シーラー",15,0.16,null,"オーデフレッシュ共通中塗",15,0.14000000000000001]
[null,"アンダーフィラー弾性エクセル",16,0.3,null,"Ｈｉビニレックスエコ６０",20,0.12]
[null,"パーフェクトフィラー",15,0.25,null,"Ｈｉビニレックスエコ７０",20,0.12]
[null,"パーフェクトサーフ",15,0.2,null,"エコフラット６０",20,0.12]
[null,"ＤＡＮフィラーエポ",16,0.4,null,"エコフラット７０",20,0.12]
[null,"ＤＡＮフィラーリフレックス",16,0.3,null,"水性ケンエース",16,0.12]
[null,"水性シルクシーラー厚膜",15,0.2,null,"ノキテンエース",20,0.3]
[null,"１液ハイポンファインデクロ",16,0.13,null,"ケンエースＧ-Ⅱ",16,0.13]
[null,"ハイポンファインプライマーⅡ",16,0.16,null,"ケンエースＧアクトⅢ",16,0.13]
[null,"ハイポン２０ファイン",20,0.2,null,"オーデコートＧエコ",15,0.13]
[null,"ハイポン２０デクロ",20,0.2,null,"水性ケンエースグロス",15,0.13]
[null,"オーデハイポンプライマー",15,0.16,null,"ケンエースＧ-Ⅱグロス",16,0.13]
[null,"１液水性デクロ",16,0.13,null,"ファインウレタンＵ１００",15,0.12]
[null,"サーモアイプライマー",16,0.16,null,"１液ファインウレタンＵ１００",15,0.12]
[null,"ジキトーンセラローラー下塗り材",16,0.8,null,"ファインシリコンフレッシュⅡ",16,0.12]
[null,"ジキトーンセラアートＳｉ下塗材",16,0.3,null,"ファインＤＦセラミック",16,0.12]
[null,"ハイポンサビスタ",15,0.11,null,"ファインＳｉ",16,0.12]
[null,"ハイポンサビスタファイン",15,0.11,null,"ファインパーフェクトトップ",15,0.11]
[null,null,null,null,null,"パーフェクトトップ",15,0.11]
[null,null,null,null,null,"立駐機床用",17.600000000000001,0.13]
[null,null,null,null,null,"オーデフレッシュＵ１００",15,0.14000000000000001]
[null,"塗膜に著しい剥がれがないこと",null,null,null,"オーデフレッシュＳｉ１００Ⅲ",15,0.14000000000000001]
[null,"塗膜に著しい剥がれ・変退色がないこと",null,null,null,"スーパーオーデフレッシュＳｉ",15,0.14000000000000001]
[null,"塗膜に著しい剥がれ・発錆がないこと",null,null,null,"オーデフレッシュＦ１００Ⅲ",15,0.14000000000000001]
[null,"塗膜に著しい剥がれ・変退色・発錆がないこと",null,null,null,"スーパーオーデフレッシＦ",15,0.14000000000000001]
[null,null,null,null,null,"防錆形ファインSi",16,0.13]
[null,null,null,null,null,"防錆形ファインウレタンU100",15,0.15]
{"$rows_left_out":35}
{"sheet":"Sheet1","index":6,"n_rows":45,"n_cols":5,"rows_kept":45,"cut":false,"hidden":true,"merged":[]}
[null,"外壁　上塗　商品","天井　　商品","鉄部　上塗　商品","その他　　商品"]
[null,"オーデフレッシュＳｉ100Ⅲ","水性ケンエース","ファインウレタンＵ100","防錆形ファインウレタンＵ１００"]
[null,"オーデフレッシュＦ100Ⅲ"," ケンエースＧ－Ⅱ ","ファインSi","防錆形ファインＳｉ"]
[null,"パワーオーデフレッシュＳｉ","ノキテンエース","ファインシリコンフレッシュ","サーモアイヤネガード "]
[null,"パワーオーデフレッシュＦ","ノキテンエースセラ","ファイン4Fセラミック","ヤネガード"]
[null,"スーパーオーデフレッシュＳｉ",null,"1液ファインウレタンU100","ハイポンダブルガードＵ"]
[null,"スーパーオーデフレッシュＦ",null,null,"ハイポンダブルガードＳｉ"]
[null,"パーフェクトトップ ",null,null,"立駐機床用"]
[null,null,null,null,"インディフレッシュセラ  "]
[null,null,null,null,"ファインパーフェクトトップ"]
[null,"外壁　中塗　商品",null,null,"ファインシリコンフレッシュ"]
[null,"オーデフレッシュＳｉ100Ⅲ",null,null,"オーデフレッシュＳｉ100Ⅲ"]
[null,"オーデフレッシュ共通中塗 ",null,null,"オーデフレッシュＦ100Ⅲ"]
[null,"パーフェクトトップ ",null,null,"パワーオーデフレッシュＳｉ"]
[null,null,null,null,"パワーオーデフレッシュＦ"]
[null,null,null,null,"スーパーオーデフレッシュＳｉ"]
[null,null,null,null,"スーパーオーデフレッシュＦ"]
[null,"外壁　下塗　商品","天井　下塗　商品",null,"パーフェクトトップ "]
[null,"アンダーフィラー弾性エクセル",null,"鉄部　下塗　商品","オーデフレッシュ共通中塗 "]
[null,"パーフェクトフィラー","水性カチオンシーラー","ハイポンファインプライマーⅡ"]
[null,"ＤＡＮフィラーエポ",null,"ハイポン20ファイン"]
[null,"ＤＡＮフィラー リフレックス",null,"１液ハイポンファインデクロ"]
[null,"水性パーフェクトシーラー",null,"ハイポン20デクロ"]
[]
[]
[]
[]
[]
[]
[null,"ナガヤ塗料株式会社","長屋SY"]
{"$rows_left_out":16}
{"sheet":"申請書","index":7,"n_rows":53,"n_cols":15,"rows_kept":53,"cut":false,"hidden":true,"merged":[[19,0,36,0],[23,2,23,5],[31,1,33,1],[19,1,21,1],[25,1,27,1],[40,2,40,6],[41,2,41,5],[29,2,29,5],[30,2,30,5],[42,2,42,5],[35,2,35,5],[34,2,34,6],[37,1,39,1],[37,7,39,7],[31,7,33,7],[28,2,28,6],[19,7,21,7],[22,2,22,6],[24,2,24,5],[36,2,36,5],[25,7,27,7]]}
[]
["日本ペイント販売株式会社",null,null,null,null,null,null,"発行月日　　年　　月　　日"]
["　　　　　　　営業所御中",null,null,null,null,null,null,"販売店名"]
[null,null,null,null,null,null,null,"担当者名"]
[]
[]
["保　証　書　発　行　申　請　書"]
[]
[null,null,null,null,null,null,null,null,null,"営　業　所"]
[]
[null,null,null,null,null,null,null,null,"所　長","担　当",null,null,null,null,"支店長"]
[]
[]
[]
["※全項目が保証書発行の必須項目（「売上と利益」欄は弊社記載項目であり除く）"]
["※塗装時期/塗装缶数/保証開始日は予定を記載"]
["宛先","管理組合/企業/個人など保証書提出先のお客様を具体的に記載",null,null,null,null,null,null,null,null,null,"下記項目は工事終了後に記載"]
["工事名",null,null,null,null,null,null,null,null,null,null,"⇒　当該項目記入後に支店長印を捺印し"]
["工事場所",null,null,null,null,null,null,null,null,null,null,"　　保証書発行を実施"]
["保証内容\n及び面積","塗装\n仕様","①上塗：",null,null,null,null,"塗装\n缶数","上塗：","缶",null,"色名"]
[null,null,"①中塗：",null,null,null,null,null,"中塗：","缶",null,"実塗装缶数","上塗：",null,"缶"]
[null,null,"①下塗：",null,null,null,null,null,"下塗：","缶",null,"実塗装缶数","中塗：",null,"缶"]
[null,"保証部位","一般外壁　/　剥離保証　などを記載",null,null,null,null,"塗装時期","月から","月まで",null,"実塗装缶数","下塗：",null,"缶"]
[null,"保証面積",null,null,null,null,"㎡","保証年数",null,"年",null,"保証開始日"]
[null,"保証開始日","　　年　　月　　日",null,null,null,"より",null,null,null,null,"その他変更点"]
[null,"塗装\n仕様","②上塗：",null,null,null,null,"塗装\n缶数","上塗：","缶",null,"色名"]
[null,null,"②中塗：",null,null,null,null,null,"中塗：","缶",null,"実塗装缶数","上塗：",null,"缶"]
[null,null,"②下塗：",null,null,null,null,null,"下塗：","缶",null,"実塗装缶数","中塗：",null,"缶"]
[null,"保証部位","鉄部　/　剥離保証　などを記載",null,null,null,null,"塗装時期","月から","月まで",null,"実塗装缶数","下塗：",null,"缶"]
[null,"保証面積",null,null,null,null,"㎡","保証年数",null,"年",null,"保証開始日"]
{"$rows_left_out":23}