{"text_format":"1","workbook":"xlsx","n_sheets":6,"sheets":["入力補助","入力","出荷証明書 ","工事　保証書","シール　保証書","VLOOK"],"not_rendered":{"charts":0,"images":0,"macros":1,"external_links":1,"defined_names":22,"comments":1,"pivot_tables":0},"unopened":[],"bounds":{"document_bytes":16777216,"sheet_cells":100000,"rows_first":2000,"rows_last":500,"rows_between":2000,"halvings":0,"cell_chars":16384,"cell_head_chars":4096},"cells_cut":0,"cells_raw":0,"read":"whole","date_system":"1900"}

{"sheet":"入力補助","index":0,"n_rows":39,"n_cols":9,"rows_kept":39,"cut":false,"hidden":true,"merged":[[4,0,6,3],[19,0,21,3],[9,0,11,3],[33,2,33,5],[32,2,32,5],[31,2,31,5],[30,2,30,5],[29,2,29,5],[28,2,28,5],[27,2,27,5],[14,0,16,3]]}
["代理店","ＭＯＲ",null,null,null,null,null,"ジャパン","ＪＡＭ"]
[{"$f":"TODAY()","v":"2024-08-22"},null,null,null,null,null,null,"ウメモト","ＵＭＥ"]
[null,null,null,null,null,null,null,"コニシ技建","ＫＯＮ"]
["ctrl+m",null,null,null,null,null,null,"サンライズ","ＳＲＳ"]
["エポのシートを末尾にコピーします。その際このシートのＢ1セルとその日の日付が入力されます。またシート名は日付以降を入力してください。",null,null,null,null,null,null,"シンコー","ＳＮＫ"]
[null,null,null,null,null,null,null,"スギタ","ＳＧＴ"]
[null,null,null,null,null,null,null,"ツダ京都","ＴＫＫ"]
[null,null,null,null,null,null,null,"ツダ　神戸","ＴＫＨ"]
["ctrl+f",null,null,null,null,null,null,"ツダ　大阪","ＴＫＯ"]
["単位が入力されます",null,null,null,null,null,null,"フジキ","ＦＪＫ"]
[null,null,null,null,null,null,null,"フヨー","ＦＵＹ"]
[null,null,null,null,null,null,null,"ボンドエンジ","ＢＥ"]
[null,null,null,null,null,null,null,"モリシタ","ＭＯＲ"]
["ctrl+s",null,null,null,null,null,null,"ヤブ原","ＹＡＢ"]
["ブック全体から特定商品の出荷実績を作成します。商品名の入力は通常時の入力と同様に下記の入力規則に従ってください。",null,null,null,null,null,null,"化研","ＫＡＭ"]
[null,null,null,null,null,null,null,"宮崎","ＭＩＹ"]
[null,null,null,null,null,null,null,"五松商事","ＧＳＳ"]
[null,null,null,null,null,null,null,"三協商事","ＳＡＮ"]
[null,null,null,null,null,null,null,"小川商事","ＯＧＡ"]
["このシートのＢ1セルを書き換える事で各代理店用のものに変えれます。単位入力に「製品一覧表シート」を利用しているので削除しないでください。",null,null,null,null,null,null,"小林塗料","ＫＯＢ"]
[null,null,null,null,null,null,null,"西山産業","ＮＩＳ"]
[null,null,null,null,null,null,null,"前田精市","ＭＡＥ"]
[null,null,null,null,null,null,null,"大協建材","ＤＡＭ"]
["入力規則",null,null,null,null,null,null,"大同塗料","ＤＡＩ"]
["「ボンド　○○○」の形式で全て全角で入力してください（ボンドの後ろの空白は全角スペース）",null,null,null,null,null,null,"中島商会","ＮＡＫ"]
["また、○○○の部分に全角スペースを使用しないでください。",null,null,null,null,null,null,"朝日興産","ＡＳＫ"]
["Ｓ・Ｗなどのアルファベットも（）を使用せずに記載してください。",null,null,null,null,null,null,"東光商会","ＴＯＫ"]
["入力例","判定","理由",null,null,null,null,"イナモト","ＩＮＭ"]
["ボンド　Ｅ２０８Ｓ","ＯＫ"]
["Ｅ２０８Ｓ","ＮＧ","「ボンド　」が入力されていない"]
{"$rows_left_out":10}
{"sheet":"入力","index":1,"n_rows":124,"n_cols":31,"rows_kept":124,"cut":false,"hidden":false,"merged":[[7,0,9,0],[7,1,9,1],[16,4,16,10],[43,3,43,4],[38,3,38,4],[39,3,39,4],[40,3,40,4],[42,3,42,4],[41,3,41,4],[37,3,37,4],[35,3,35,4],[33,3,33,4],[34,3,34,4],[29,3,29,4],[30,3,30,4],[26,3,26,4],[1,4,1,10],[28,7,28,8],[2,4,2,10],[3,4,3,10],[4,4,4,10],[5,4,5,10],[6,4,6,10],[7,4,7,10],[8,4,8,10],[9,4,9,10],[11,4,11,10],[12,4,12,10],[28,3,28,4],[13,4,13,10],[14,4,14,10],[15,4,15,10],[36,3,36,4],[31,3,31,4],[32,3,32,4],[25,3,25,4],[19,4,19,10],[27,3,27,4],[28,5,28,6],[28,14,28,15],[28,19,28,20],[28,24,28,25],[28,29,28,30],[17,4,17,10],[18,4,18,10]]}
["全書面共通",null,null,"工事：保証書用"]
[null,null,null,"工事名称",{"$f":"IF(B19=\"\",\"\",B19)","v":"北浜コニシビル改修工事"},null,null,null,null,null,null,null,null,null,null,null,null,null,{"$f":"TEXT(B3, \"YYMMDD\")","v":"230815"}]
["【依頼日】       入力例：2023/8/9","令和5年8月15日",null,"現場住所",{"$f":"IF(B20=\"\",\"\",B20)","v":"〇〇府〇〇市〇〇-〇〇"},null,null,null,null,null,null,null,null,null,null,null,null,null,{"$f":"S2&\"_\"&B2&\"_\"&B19","v":"230815__北浜コニシビル改修工事"}]
["【依頼者（得意先名）】","〇〇カンパニー",null,"施工箇所","外壁"]
["【部数】保証書(シール)",3,null,"施工仕様・施工量","プルダウンより選択ください。"]
["【部数】保証書（補修）",3,null,"使用材料・使用量","※保証書には出荷証明書に入力した製品名と出荷数量が表記されます。"]
["【部数】出荷証明書",2,null,"保証開始日",{"$f":"IF(B17=\"\",\"\",B17)","v":"令和5年7月10日"}]
["備考","※書類作成、発送に関し注意すべき事項を記載ください",null,"保証年数",{"$f":"IF(B18=\"\",\"\",B18)","v":5}]
[null,null,null,"元請業者",{"$f":"IF(B21=\"\",\"\",B21)","v":"株式会社　小西組"}]
[null,null,null,"施工業者",{"$f":"IF(B22=\"\",\"\",B22)","v":"Konishi.Building"}]
["【送付先名】","株式会社ABC",null,"シーリング：保証書用"]
["【担当者名】","小西　太郎",null,"工事名称",{"$f":"IF(B19=\"\",\"\",B19)","v":"北浜コニシビル改修工事"}]
["【送付先　アドレス】","konishi@bond.co.jp",null,"現場住所",{"$f":"IF(B20=\"\",\"\",B20)","v":"〇〇府〇〇市〇〇-〇〇"}]
["書類発行日付   入力例：2023/8/9",null,null,"施工箇所","外壁タイル目地・サッシ廻り・笠木取合い・打継・トップライトガラス・建具周り"]
["保証書宛名","田中　一郎",null,"施工仕様・施工量","シーリング工事　入力不可"]
["保証書宛名敬称","プルダウンより選択ください",null,"使用材料・使用量","※保証書には出荷証明書に入力した製品名と出荷数量が表記されます。"]
["保障開始日   入力例：2023/8/9","令和5年7月10日",null,"保証開始日",{"$f":"IF(B17=\"\",\"\",B17)","v":"令和5年7月10日"}]
["保証年数",5,null,"保証年数",{"$f":"IF(B18=\"\",\"\",B18)","v":5}]
["工事名称","北浜コニシビル改修工事",null,"元請業者",{"$f":"IF(B21=\"\",\"\",B21)","v":"株式会社　小西組"}]
["現場住所","〇〇府〇〇市〇〇-〇〇",null,"施工業者",{"$f":"IF(B22=\"\",\"\",B22)","v":"Konishi.Building"}]
["元請業者","株式会社　小西組"]
["施工業者","Konishi.Building"]
[]
[]
["工事：出荷証明書用　製品名等"]
[null,null,null,"出荷日"]
["出荷日　□　選択下さい。  ",null,1,"令和5年12月19日"]
[null,null,2,"令和5年12月20日～令和5年12月22日",null,null,null,null,null,null,null,null,null,"下地補修",null,null,null,null,"下地補修",null,null,null,null,"シーリング補修",null,null,null,null,"シーリング補修"]
[null,"出荷日確認用","No","製品名（工事　補修）",null,"出荷単位",null,"出荷量",null,"Lot.No","vlook確認",null,"ＮＯ","品　　　　　名","荷姿",null,null,"ＮＯ","品　　　　　名","荷姿",null,null,"ＮＯ","品　　　　　名","荷姿",null,null,"ＮＯ","品　　　　　名","荷姿"]
["出荷日",{"$f":"IF($A$105, $D$27, IF($A$106, $D$28, \"\"))","v":"令和5年12月19日"},1,{"$f":"IF(C30=\"\",\"\",VLOOKUP(C30,VLOOK!$B$3:$N$1000,3,FALSE))","v":"ボンド　Ｅ２０６"},null,{"$f":"IF(C30=\"\", \"\", IF(VLOOKUP(C30, VLOOK!$B$3:$N$1000, 4, FALSE) = 0, \"\", VLOOKUP(C30, VLOOK!$B$3:$N$1000, 4, FALSE)))","v":3},{"$f":"IF(C30=\"\", \"\", IF(VLOOKUP(C30, VLOOK!$B$3:$N$1000, 6, FALSE) = 0, \"\", VLOOKUP(C30, VLOOK!$B$3:$N$1000, 6, FALSE)))","v":"kgset"},1,{"$f":"IF(C30=\"\", \"\", IF(VLOOKUP(C30, VLOOK!$B$3:$N$1000, 9, FALSE) = 0, \"\", VLOOKUP(C30, VLOOK!$B$3:$N$1000, 9, FALSE)))","v":"set"},"241122AA/241112BA",{"$f":"IF(C30<>\"\", IF(COUNTIF($M$30:$AC$120, C30) = 0, \"注\", \"\"), \"\")","v":""},null,"0","以下余白",null,null,null,32,"Ｋモルタル",6,"kgset",null,51,"ＭＳシール",4,"Lset",null,85,"ウレタンコーク",320,"ｍｌ"]
{"$rows_left_out":95}
{"sheet":"出荷証明書 ","index":2,"n_rows":36,"n_cols":16,"rows_kept":36,"cut":false,"hidden":false,"merged":[[31,7,31,11],[32,7,32,11],[29,2,29,6],[30,2,30,6],[31,2,31,6],[32,2,32,6],[29,7,29,11],[30,7,30,11],[19,7,19,11],[20,7,20,11],[21,7,21,11],[22,7,22,11],[23,7,23,11],[25,2,25,6],[26,2,26,6],[27,2,27,6],[28,2,28,6],[24,7,24,11],[25,7,25,11],[26,7,26,11],[27,7,27,11],[28,7,28,11],[18,2,18,6],[18,7,18,11],[25,0,25,1],[18,0,18,1],[19,0,19,1],[20,0,20,1],[21,0,21,1],[22,0,22,1],[23,0,23,1],[24,0,24,1],[19,2,19,6],[20,2,20,6],[21,2,21,6],[22,2,22,6],[23,2,23,6],[24,2,24,6],[31,0,31,1],[32,0,32,1],[26,0,26,1],[27,0,27,1],[28,0,28,1],[29,0,29,1],[30,0,30,1],[17,12,17,13],[17,14,17,15],[5,0,5,15],[7,0,7,15],[10,0,10,15],[11,0,11,15],[12,1,12,15],[13,1,13,15],[14,1,14,15],[15,1,15,15],[17,0,17,1],[17,7,17,11],[17,2,17,6],[0,12,0,13],[0,14,0,15],[3,0,3,15],[1,9,1,15],[16,0,16,15],[8,10,8,15]]}
[null,null,null,null,null,null,null,null,null,null,null,null,{"$f":"IF(入力!B2=\"\",\"\",入力!B2)","v":""}]
[null,null,null,null,null,null,null,null,null,{"$f":"IF(入力!B14=\"\",\"　　年　　月　　日\",入力!B14)","v":"　　年　　月　　日"}]
[]
["出荷証明書"]
[]
[{"$f":"IF(入力!B15=\"\",\"　　　　　　　　\"&IF(入力!B16=\"\",\"\",入力!B16),入力!B15&\"　\"&IF(入力!B16=\"\",\"\",入力!B16))","v":"田中　一郎　プルダウンより選択ください"}]
[]
[]
[]
[]
[]
[]
["工 事 名 称",{"$f":"IF(入力!B19=0,\"\",入力!B19)&\"\"","v":"北浜コニシビル改修工事"}]
["（ 現 場 名 ）"]
["元 請 業 者",{"$f":"IF(入力!B21=0,\"\",入力!B21)&\"\"","v":"株式会社　小西組"}]
["施 工 業 者",{"$f":"IF(入力!B22=0,\"\",入力!B22)&\"\"","v":"Konishi.Building"}]
["  納 入 明 細"]
["出荷年月日",null,"品　　　　　　　　　　　名",null,null,null,null,"Lot No.",null,null,null,null,"出荷単位",null,"出荷量"]
[{"$f":"IF(入力!B30=0,\"\",入力!B30)","v":"令和5年12月19日"},null,{"$f":"IF(入力!C30=\"\",\"\",VLOOKUP(入力!C30,VLOOK!$B$3:$N$573,3,FALSE) )","v":"ボンド　Ｅ２０６"},null,null,null,null,{"$f":" IF(入力!J30=\"\", \"\", 入力!J30)","v":"241122AA/241112BA"},null,null,null,null,{"$f":"入力!F30","v":3},{"$f":"入力!G30","v":"kgset"},{"$f":"IF(入力!H30=\"\",\"\",入力!H30)","v":1},{"$f":"入力!I30","v":"set"}]
[{"$f":"IF(入力!B31=0,\"\",入力!B31)","v":"令和5年12月20日～令和5年12月22日"},null,{"$f":"IF(入力!C31=\"\",\"\",VLOOKUP(入力!C31,VLOOK!$B$3:$N$573,3,FALSE) )","v":"ボンド　Ｅ２０９Ｓ"},null,null,null,null,{"$f":" IF(入力!J31=\"\", \"\", 入力!J31)","v":"240328AA/240329AA"},null,null,null,null,{"$f":"入力!F31","v":6},{"$f":"入力!G31","v":"kgset"},{"$f":"IF(入力!H31=\"\",\"\",入力!H31)","v":2},{"$f":"入力!I31","v":"set"}]
[{"$f":"IF(入力!B32=0,\"\",入力!B32)","v":"令和5年12月19日"},null,{"$f":"IF(入力!C32=\"\",\"\",VLOOKUP(入力!C32,VLOOK!$B$3:$N$573,3,FALSE) )","v":"ボンド　ユニエポ補修用プライマー"},null,null,null,null,{"$f":" IF(入力!J32=\"\", \"\", 入力!J32)","v":"240328BB"},null,null,null,null,{"$f":"入力!F32","v":500},{"$f":"入力!G32","v":"g"},{"$f":"IF(入力!H32=\"\",\"\",入力!H32)","v":3},{"$f":"入力!I32","v":"缶"}]
[{"$f":"IF(入力!B33=0,\"\",入力!B33)","v":"令和5年12月19日"},null,{"$f":"IF(入力!C33=\"\",\"\",VLOOKUP(入力!C33,VLOOK!$B$3:$N$573,3,FALSE) )","v":"ボンド　シールプライマー＃３８"},null,null,null,null,{"$f":" IF(入力!J33=\"\", \"\", 入力!J33)","v":"240328BB"},null,null,null,null,{"$f":"入力!F33","v":500},{"$f":"入力!G33","v":"g"},{"$f":"IF(入力!H33=\"\",\"\",入力!H33)","v":4},{"$f":"入力!I33","v":"缶"}]
[{"$f":"IF(入力!B34=0,\"\",入力!B34)","v":"令和5年12月19日"},null,{"$f":"IF(入力!C34=\"\",\"\",VLOOKUP(入力!C34,VLOOK!$B$3:$N$573,3,FALSE) )","v":"ボンド　シールカラーマスター　グレー"},null,null,null,null,{"$f":" IF(入力!J34=\"\", \"\", 入力!J34)","v":"240328BB"},null,null,null,null,{"$f":"入力!F34","v":160},{"$f":"入力!G34","v":"g"},{"$f":"IF(入力!H34=\"\",\"\",入力!H34)","v":5},{"$f":"入力!I34","v":"個"}]
[{"$f":"IF(入力!B35=0,\"\",入力!B35)","v":"令和5年12月20日～令和5年12月22日"},null,{"$f":"IF(入力!C35=\"\",\"\",VLOOKUP(入力!C35,VLOOK!$B$3:$N$573,3,FALSE) )","v":"ボンド　ビューシール６９０９"},null,null,null,null,{"$f":" IF(入力!J35=\"\", \"\", 入力!J35)","v":"240328AA/240329AA"},null,null,null,null,{"$f":"入力!F35","v":6},{"$f":"入力!G35","v":"Lset"},{"$f":"IF(入力!H35=\"\",\"\",入力!H35)","v":1},{"$f":"入力!I35","v":"set"}]
[{"$f":"IF(入力!B36=0,\"\",入力!B36)","v":"令和5年12月20日～令和5年12月22日"},null,{"$f":"IF(入力!C36=\"\",\"\",VLOOKUP(入力!C36,VLOOK!$B$3:$N$573,3,FALSE) )","v":"ボンド　ウレタンコーク"},null,null,null,null,{"$f":" IF(入力!J36=\"\", \"\", 入力!J36)","v":"240328BB"},null,null,null,null,{"$f":"入力!F36","v":320},{"$f":"入力!G36","v":"ml"},{"$f":"IF(入力!H36=\"\",\"\",入力!H36)","v":1},{"$f":"入力!I36","v":"本"}]
[{"$f":"IF(入力!B37=0,\"\",入力!B37)","v":""},null,{"$f":"IF(入力!C37=\"\",\"\",VLOOKUP(入力!C37,VLOOK!$B$3:$N$573,3,FALSE) )","v":"以　　下　　余　　白"},null,null,null,null,{"$f":" IF(入力!J37=\"\", \"\", 入力!J37)","v":""},null,null,null,null,{"$f":"入力!F37","v":""},{"$f":"入力!G37","v":""},{"$f":"IF(入力!H37=\"\",\"\",入力!H37)","v":""},{"$f":"入力!I37","v":""}]
[{"$f":"IF(入力!B38=0,\"\",入力!B38)","v":""},null,{"$f":"IF(入力!C38=\"\",\"\",VLOOKUP(入力!C38,VLOOK!$B$3:$N$573,3,FALSE) )","v":""},null,null,null,null,{"$f":" IF(入力!J38=\"\", \"\", 入力!J38)","v":""},null,null,null,null,{"$f":"入力!F38","v":""},{"$f":"入力!G38","v":""},{"$f":"IF(入力!H38=\"\",\"\",入力!H38)","v":""},{"$f":"入力!I38","v":""}]
[{"$f":"IF(入力!B39=0,\"\",入力!B39)","v":""},null,{"$f":"IF(入力!C39=\"\",\"\",VLOOKUP(入力!C39,VLOOK!$B$3:$N$573,3,FALSE) )","v":""},null,null,null,null,{"$f":" IF(入力!J39=\"\", \"\", 入力!J39)","v":""},null,null,null,null,{"$f":"入力!F39","v":""},{"$f":"入力!G39","v":""},{"$f":"IF(入力!H39=\"\",\"\",入力!H39)","v":""},{"$f":"入力!I39","v":""}]
[{"$f":"IF(入力!B40=0,\"\",入力!B40)","v":""},null,{"$f":"IF(入力!C40=\"\",\"\",VLOOKUP(入力!C40,VLOOK!$B$3:$N$573,3,FALSE) )","v":""},null,null,null,null,{"$f":" IF(入力!J40=\"\", \"\", 入力!J40)","v":""},null,null,null,null,{"$f":"入力!F40","v":""},{"$f":"入力!G40","v":""},{"$f":"IF(入力!H40=\"\",\"\",入力!H40)","v":""},{"$f":"入力!I40","v":""}]
[{"$f":"IF(入力!B41=0,\"\",入力!B41)","v":""},null,{"$f":"IF(入力!C41=\"\",\"\",VLOOKUP(入力!C41,VLOOK!$B$3:$N$573,3,FALSE) )","v":""},null,null,null,null,{"$f":" IF(入力!J41=\"\", \"\", 入力!J41)","v":""},null,null,null,null,{"$f":"入力!F41","v":""},{"$f":"入力!G41","v":""},{"$f":"IF(入力!H41=\"\",\"\",入力!H41)","v":""},{"$f":"入力!I41","v":""}]
{"$rows_left_out":7}
{"sheet":"工事　保証書","index":3,"n_rows":43,"n_cols":11,"rows_kept":43,"cut":false,"hidden":false,"merged":[[0,0,1,8],[20,1,20,8],[21,1,21,8],[5,6,5,7],[4,7,4,8],[11,1,11,4],[10,1,10,4],[19,1,19,8],[12,1,12,4],[13,1,13,4],[14,1,14,4],[15,1,15,4],[18,1,18,8]]}
["保　　証　　書"]
[]
[]
[null,null,null,null,null,null,null,{"$f":"IF(入力!B2=\"\",\"\",入力!B2)","v":""}]
[null,null,null,null,null,null,null,{"$f":"IF(入力!B14=\"\",\"　　年　　月　　日\",入力!B14)","v":"　　年　　月　　日"}]
[]
[]
[null,{"$f":"IF(入力!B15=\"\",\"　　　　　　　　\"&IF(入力!B16=\"\",\"\",入力!B16),入力!B15&\"　\"&IF(入力!B16=\"\",\"\",入力!B16))","v":"田中　一郎　プルダウンより選択ください"}]
["                                                             "]
[]
[null,"工　　事　　名　　称",null,null,null,null,"：",{"$f":"IF(入力!E2=\"\", \"\", SUBSTITUTE(入力!E2, CHAR(10), CHAR(10) & CHAR(13)))","v":"北浜コニシビル改修工事"}]
[null,"現　　場　　住　　所",null,null,null,null,"：",{"$f":"IF(入力!E3=\"\", \"\", SUBSTITUTE(入力!E3, CHAR(10), CHAR(10) & CHAR(13)))","v":"〇〇府〇〇市〇〇-〇〇"}]
[null,"施　　工　　箇　　所",null,null,null,null,"：",{"$f":"IF(入力!E4=\"\", \"\", SUBSTITUTE(入力!E4, CHAR(10), CHAR(10) & CHAR(13)))","v":"外壁"}]
[null,"施工仕様・施工量",null,null,null,null,"：",{"$f":"IF(入力!E5=\"\", \"\", SUBSTITUTE(入力!E5, CHAR(10), CHAR(10) & CHAR(13)))","v":"プルダウンより選択ください。"}]
[null,"使用材料・使用量",null,null,null,null,"：",{"$f":"IF(入力!A91=\"\", \"\", SUBSTITUTE(入力!A91, CHAR(10), CHAR(10) & CHAR(13)))","v":"ボンド　Ｅ２０６  1setボンド　ユニエポ補修用プライマー  3缶ボンド　ビューシール６９０９  1set､ボンド　ウレタンコーク  1本"}]
[null,"保　　証　　期　　間",null,null,null,null,"：",{"$f":"IF(入力!E17=\"\", \"\",入力!E17&\" より \"&入力!E18&\"年間\")","v":"令和5年7月10日 より 5年間"}]
[]
[]
[null,"　上記工事に関し、保証期間内に施工箇所に欠陥等が生じた場合、当事者が立会って"]
[null,"原因を調査し、協議の上、当方に過失のある場合は該当箇所を施工についての欠陥は"]
[null,"甲と乙が、又丙の材料に関しての欠陥は丙がそれぞれ補修責任を負担いたします。"]
[null,"但し、下記の事項につきましては、免責とさせて頂きます。"]
[]
[null,null,null,"（１）","天変地異、及びその他不可抗力による場合。"]
[null,null,null,"（２）","構造上及び設計上の欠陥に起因する場合。"]
[null,null,null,"（３）","材料の許容性能を超えて使用された場合。"]
[null,null,null,"（４）","施工部位外で生じた事故及び故意の損傷による場合。"]
[null,null,null,"（５）","原因究明が通常の方法によっては困難と認められる場合。"]
[]
[]
{"$rows_left_out":14}
{"sheet":"シール　保証書","index":4,"n_rows":46,"n_cols":13,"rows_kept":46,"cut":false,"hidden":false,"merged":[[0,0,1,8],[20,1,20,8],[21,1,21,8],[5,6,5,7],[10,1,10,4],[11,1,11,4],[12,1,12,4],[16,1,16,4],[13,1,13,4],[14,1,14,4],[15,1,15,4],[19,1,19,8],[4,7,4,8]]}
["保　　証　　書",null,null,null,null,null,null,null,null,null,null,null,{"$f":"'シール　保証書'!H4","v":""}]
[]
[]
[null,null,null,null,null,null,null,{"$f":"IF(入力!B2=\"\",\"\",入力!B2)","v":""}]
[null,null,null,null,null,null,null,{"$f":"IF(入力!B14=\"\",\"　　年　　月　　日\",入力!B14)","v":"　　年　　月　　日"}]
[]
[]
[null,{"$f":"IF(入力!B15=\"\",\"　　　　　　　　\"&IF(入力!B16=\"\",\"\",入力!B16),入力!B15&\"　\"&IF(入力!B16=\"\",\"\",入力!B16))","v":"田中　一郎　プルダウンより選択ください"}]
["                                                    "]
[]
[null,"工　　事　　名　　称",null,null,null,null,"：",{"$f":"IF(入力!E12=\"\", \"\", SUBSTITUTE(入力!E12, CHAR(10), CHAR(10) & CHAR(13)))","v":"北浜コニシビル改修工事"}]
[null,"現　　場　　住　　所",null,null,null,null,"：",{"$f":"IF(入力!E13=\"\", \"\", SUBSTITUTE(入力!E13, CHAR(10), CHAR(10) & CHAR(13)))","v":"〇〇府〇〇市〇〇-〇〇"}]
[null,"施　　工　　箇　　所",null,null,null,null,"：",{"$f":"IF(入力!E14=\"\", \"\", SUBSTITUTE(入力!E14, CHAR(10), CHAR(10) & CHAR(13)))","v":"外壁タイル目地・サッシ廻り・笠木取合い・打継・トップライトガラス・建具周り"}]
[null,"施工仕様・施工量",null,null,null,null,"：","シーリング工事"]
[null,"使用材料・使用量",null,null,null,null,"：",{"$f":"IF(入力!B91=\"\", \"\", SUBSTITUTE(入力!B91, CHAR(10), CHAR(10) & CHAR(13)))","v":"ボンド　シールプライマー＃３８  4缶､ボンド　シールカラーマスター　グレー  5個"}]
[null,"保　　証　　内　　容",null,null,null,null,"：","防水機能の維持（漏水に至るはく離・破断を生じないこと）"]
[null,"保　　証　　期　　間",null,null,null,null,"：",{"$f":"IF(入力!E17=\"\", \"\",入力!E17&\" より \"&入力!E18&\"年間\")","v":"令和5年7月10日 より 5年間"}]
[]
[]
[null,"　上記シーリング工事に関し、防水保証期間内にシーリング材のはく離・破断が原因で、"]
[null,"室内漏水事故が生じた場合、当事者が立会って原因を調査し,協議の上、当方に過失"]
[null,"のある場合は該当箇所を、施工についての欠陥は甲と乙が、又丙の材料に関しての"]
[null,"欠陥は丙がそれぞれ補修責任を負担いたします。"]
[null,"但し、下記の事項につきましては、免責とさせて頂きます。"]
[]
[null,null,null,"（１）","天変地異、及びその他不可抗力による場合。"]
[null,null,null,"（２）","構造上及び設計上の欠陥に起因する場合。"]
[null,null,null,"（３）","材料の許容性能を超えて使用された場合。"]
[null,null,null,"（４）","施工部位外で生じた事故及び故意の損傷による場合。"]
[null,null,null,"（５）","原因究明が通常の方法によっては困難と認められる場合。"]
{"$rows_left_out":17}
{"sheet":"VLOOK","index":5,"n_rows":573,"n_cols":14,"rows_kept":573,"cut":false,"hidden":false,"merged":[]}
[null,1,2,3,4,5,6,7,8,9,10,11,12,13]
[null,"ＮＯ","コード","品　　　　　名","荷姿",null,null,"出荷単位",null,null,null,"出荷量"]
[null,0,1,"以　　下　　余　　白"]
["え２０６ｓ*",1,"1156015003*","ボンド　Ｅ２０６",3,null,"kgset",null,null,"set",{"$f":"E4*H4","v":0},null,{"$f":"IF(D4=\"\",\"\",G4)","v":"kgset"},{"$f":"IF(D4=\"\",\"\",G4)","v":"kgset"}]
["え２０６ｓ",2,1156015003,"ボンド　Ｅ２０６Ｓ",3,null,"kgset",null,null,"set",0,null,"kgset","kgset"]
["え２０６ｗ",3,1156090003,"ボンド　Ｅ２０６Ｗ",3,null,"kgset",null,null,"set",0,null,"kgset","kgset"]
["え２０７ｄｓ*",4,"1156190003*","ボンド　Ｅ２０７Ｄ",3,null,"kgset",null,null,"set",0,null,"kgset","kgset"]
["え２０７ｄｓ",5,1156190003,"ボンド　Ｅ２０７ＤＳ",3,null,"kgset",null,null,"set",0,null,"kgset","kgset"]
["え２０７ｄｗ",6,1156641003,"ボンド　Ｅ２０７ＤＷ",3,null,"kgset",null,null,"set",0,null,"kgset","kgset"]
["え２０８ｓ*",7,"1156063003*","ボンド　Ｅ２０８",3,null,"kgset",null,null,"set",0,null,"kgset","kgset"]
["え２０８ｓ",8,1156063003,"ボンド　Ｅ２０８Ｓ",3,null,"kgset",null,null,"set",0,null,"kgset","kgset"]
["え２０８ｗ",9,1156093003,"ボンド　Ｅ２０８Ｗ",3,null,"kgset",null,null,"set",0,null,"kgset","kgset"]
[null,10,1156064003,"ボンド　Ｅ２０８ＳＳ",3,null,"kgset",null,null,"set",{"$f":"E13*H13","v":0},null,{"$f":"IF(D13=\"\",\"\",G13)","v":"kgset"},{"$f":"IF(D13=\"\",\"\",G13)","v":"kgset"}]
["え２０９ｓ３*",11,"1156045003*","ボンド　Ｅ２０９",3,null,"kgset",null,null,"set",0,null,"kgset","kgset"]
["え２０９ｓ３",12,1156045003,"ボンド　Ｅ２０９Ｓ",3,null,"kgset",null,null,"set",0,null,"kgset","kgset"]
["え２０９ｗ３",13,1156042003,"ボンド　Ｅ２０９Ｗ",3,null,"kgset",null,null,"set",0,null,"kgset","kgset"]
["え２０９ｓ６*",14,"1156045006*","ボンド　Ｅ２０９",6,null,"kgset",null,null,"set",0,null,"kgset","kgset"]
["え２０９ｓ６",15,1156045006,"ボンド　Ｅ２０９Ｓ",6,null,"kgset",null,null,"set",0,null,"kgset","kgset"]
["え２０９ｗ６",16,1156182006,"ボンド　Ｅ２０９Ｗ",6,null,"kgset",null,null,"set",0,null,"kgset","kgset"]
[null,17,1156195006,"ボンド　Ｅ２０９ＳＳ",6,null,"kgset",null,null,"set",{"$f":"E20*H20","v":0},null,{"$f":"IF(D20=\"\",\"\",G20)","v":"kgset"},{"$f":"IF(D20=\"\",\"\",G20)","v":"kgset"}]
["え６００",18,1156442410,"ボンド　Ｅ６００",10,null,"kgset",null,null,"set",0,null,"kgset","kgset"]
["え２３００ｊｓ*",19,"1157021015*","ボンド　Ｅ２３００Ｊ",15,null,"kgset",null,null,"set",0,null,"kgset","kgset"]
["え２３００ｊｓ",20,1157021015,"ボンド　Ｅ２３００ＪＳ",15,null,"kgset",null,null,"set",0,null,"kgset","kgset"]
["え２３００ｊｗ",21,1157027015,"ボンド　Ｅ２３００ＪＷ",15,null,"kgset",null,null,"set",0,null,"kgset","kgset"]
["1157414015",22,1157414015,"ボンド　ＲＭ骨材",15,null,"kg",null,null,"袋",0,null,"kg","kg"]
["え２３７０ｍｓ*",23,"1157096015*","ボンド　Ｅ２３７０Ｍ",15,null,"kgset",null,null,"set",0,null,"kgset","kgset"]
["え２３７０ｍｓ",24,1157096015,"ボンド　Ｅ２３７０ＭＳ",15,null,"kgset",null,null,"set",0,null,"kgset","kgset"]
["え２３７０ｍｗ",25,1157099015,"ボンド　Ｅ２３７０ＭＷ",15,null,"kgset",null,null,"set",0,null,"kgset","kgset"]
["え２０５",26,1156623004,"ボンド　Ｅ２０５",4,null,"kgset",null,null,"set",0,null,"kgset","kgset"]
["え２３００ｓ*",27,"1157078415*","ボンド　Ｅ２３００",15,null,"kgset",null,null,"set",0,null,"kgset","kgset"]
{"$rows_left_out":543}