{"text_format":"1","workbook":"xlsx","n_sheets":6,"sheets":["入力補助","入力","出荷証明書 ","工事　保証書","シール　保証書","VLOOK"],"not_rendered":{"charts":0,"images":0,"macros":1,"external_links":1,"defined_names":22,"comments":1,"pivot_tables":0},"unopened":[],"bounds":{"document_bytes":16777216,"sheet_cells":100000,"rows_first":2000,"rows_last":500,"rows_between":2000,"halvings":0,"cell_chars":16384,"cell_head_chars":4096},"cells_cut":0,"cells_raw":0,"read":"whole","date_system":"1900"}

{"sheet":"入力補助","index":0,"n_rows":39,"n_cols":9,"rows_kept":39,"cut":false,"hidden":true,"merged":[[4,0,6,3],[19,0,21,3],[9,0,11,3],[33,2,33,5],[32,2,32,5],[31,2,31,5],[30,2,30,5],[29,2,29,5],[28,2,28,5],[27,2,27,5],[14,0,16,3]]}
["代理店","ＭＯＲ",null,null,null,null,null,"ジャパン","ＪＡＭ"]
[{"$f":"TODAY()","v":"2024-08-22"},null,null,null,null,null,null,"ウメモト","ＵＭＥ"]
[null,null,null,null,null,null,null,"コニシ技建","ＫＯＮ"]
["ctrl+m",null,null,null,null,null,null,"サンライズ","ＳＲＳ"]
["エポのシートを末尾にコピーします。その際このシートのＢ1セルとその日の日付が入力されます。またシート名は日付以降を入力してください。",null,null,null,null,null,null,"シンコー","ＳＮＫ"]
[null,null,null,null,null,null,null,"スギタ","ＳＧＴ"]
[null,null,null,null,null,null,null,"ツダ京都","ＴＫＫ"]
[null,null,null,null,null,null,null,"ツダ　神戸","ＴＫＨ"]
["ctrl+f",null,null,null,null,null,null,"ツダ　大阪","ＴＫＯ"]
["単位が入力されます",null,null,null,null,null,null,"フジキ","ＦＪＫ"]
[null,null,null,null,null,null,null,"フヨー","ＦＵＹ"]
[null,null,null,null,null,null,null,"ボンドエンジ","ＢＥ"]
[null,null,null,null,null,null,null,"モリシタ","ＭＯＲ"]
["ctrl+s",null,null,null,null,null,null,"ヤブ原","ＹＡＢ"]
["ブック全体から特定商品の出荷実績を作成します。商品名の入力は通常時の入力と同様に下記の入力規則に従ってください。",null,null,null,null,null,null,"化研","ＫＡＭ"]
[null,null,null,null,null,null,null,"宮崎","ＭＩＹ"]
[null,null,null,null,null,null,null,"五松商事","ＧＳＳ"]
[null,null,null,null,null,null,null,"三協商事","ＳＡＮ"]
[null,null,null,null,null,null,null,"小川商事","ＯＧＡ"]
["このシートのＢ1セルを書き換える事で各代理店用のものに変えれます。単位入力に「製品一覧表シート」を利用しているので削除しないでください。",null,null,null,null,null,null,"小林塗料","ＫＯＢ"]
[null,null,null,null,null,null,null,"西山産業","ＮＩＳ"]
[null,null,null,null,null,null,null,"前田精市","ＭＡＥ"]
[null,null,null,null,null,null,null,"大協建材","ＤＡＭ"]
["入力規則",null,null,null,null,null,null,"大同塗料","ＤＡＩ"]
["「ボンド　○○○」の形式で全て全角で入力してください（ボンドの後ろの空白は全角スペース）",null,null,null,null,null,null,"中島商会","ＮＡＫ"]
["また、○○○の部分に全角スペースを使用しないでください。",null,null,null,null,null,null,"朝日興産","ＡＳＫ"]
["Ｓ・Ｗなどのアルファベットも（）を使用せずに記載してください。",null,null,null,null,null,null,"東光商会","ＴＯＫ"]
["入力例","判定","理由",null,null,null,null,"イナモト","ＩＮＭ"]
["ボンド　Ｅ２０８Ｓ","ＯＫ"]
["Ｅ２０８Ｓ","ＮＧ","「ボンド　」が入力されていない"]
["ボンド　E208S","ＮＧ","「E208S」が半角になっている"]
["ボンド Ｅ２０８Ｓ","ＮＧ","スペースが半角になっている"]
["ボンド　Ｅ２０８（Ｓ）","ＮＧ","（）が使用されている"]
["ボンド　Ｅ２０８　Ｓ","ＮＧ","Ｓの前にスペースが挿入されている"]
[]
["上記の入力規則を満たしているにも関わらず単位が入力されない場合、製品一覧表シートに商品を追加してください。"]
["追加手順は以下の通りです。"]
["①製品一覧表シートの最終行に製品情報を入力する。"]
["②製品名列（Ｃ列）で昇順にソート"]

{"sheet":"入力","index":1,"n_rows":124,"n_cols":31,"rows_kept":124,"cut":false,"hidden":false,"merged":[[7,0,9,0],[7,1,9,1],[16,4,16,10],[43,3,43,4],[38,3,38,4],[39,3,39,4],[40,3,40,4],[42,3,42,4],[41,3,41,4],[37,3,37,4],[35,3,35,4],[33,3,33,4],[34,3,34,4],[29,3,29,4],[30,3,30,4],[26,3,26,4],[1,4,1,10],[28,7,28,8],[2,4,2,10],[3,4,3,10],[4,4,4,10],[5,4,5,10],[6,4,6,10],[7,4,7,10],[8,4,8,10],[9,4,9,10],[11,4,11,10],[12,4,12,10],[28,3,28,4],[13,4,13,10],[14,4,14,10],[15,4,15,10],[36,3,36,4],[31,3,31,4],[32,3,32,4],[25,3,25,4],[19,4,19,10],[27,3,27,4],[28,5,28,6],[28,14,28,15],[28,19,28,20],[28,24,28,25],[28,29,28,30],[17,4,17,10],[18,4,18,10]]}
["全書面共通",null,null,"工事：保証書用"]
[null,null,null,"工事名称",{"$f":"IF(B19=\"\",\"\",B19)","v":"北浜コニシビル改修工事"},null,null,null,null,null,null,null,null,null,null,null,null,null,{"$f":"TEXT(B3, \"YYMMDD\")","v":"230815"}]
["【依頼日】       入力例：2023/8/9","令和5年8月15日",null,"現場住所",{"$f":"IF(B20=\"\",\"\",B20)","v":"〇〇府〇〇市〇〇-〇〇"},null,null,null,null,null,null,null,null,null,null,null,null,null,{"$f":"S2&\"_\"&B2&\"_\"&B19","v":"230815__北浜コニシビル改修工事"}]
["【依頼者（得意先名）】","〇〇カンパニー",null,"施工箇所","外壁"]
["【部数】保証書(シール)",3,null,"施工仕様・施工量","プルダウンより選択ください。"]
["【部数】保証書（補修）",3,null,"使用材料・使用量","※保証書には出荷証明書に入力した製品名と出荷数量が表記されます。"]
["【部数】出荷証明書",2,null,"保証開始日",{"$f":"IF(B17=\"\",\"\",B17)","v":"令和5年7月10日"}]
["備考","※書類作成、発送に関し注意すべき事項を記載ください",null,"保証年数",{"$f":"IF(B18=\"\",\"\",B18)","v":5}]
[null,null,null,"元請業者",{"$f":"IF(B21=\"\",\"\",B21)","v":"株式会社　小西組"}]
[null,null,null,"施工業者",{"$f":"IF(B22=\"\",\"\",B22)","v":"Konishi.Building"}]
["【送付先名】","株式会社ABC",null,"シーリング：保証書用"]
["【担当者名】","小西　太郎",null,"工事名称",{"$f":"IF(B19=\"\",\"\",B19)","v":"北浜コニシビル改修工事"}]
["【送付先　アドレス】","konishi@bond.co.jp",null,"現場住所",{"$f":"IF(B20=\"\",\"\",B20)","v":"〇〇府〇〇市〇〇-〇〇"}]
["書類発行日付   入力例：2023/8/9",null,null,"施工箇所","外壁タイル目地・サッシ廻り・笠木取合い・打継・トップライトガラス・建具周り"]
["保証書宛名","田中　一郎",null,"施工仕様・施工量","シーリング工事　入力不可"]
["保証書宛名敬称","プルダウンより選択ください",null,"使用材料・使用量","※保証書には出荷証明書に入力した製品名と出荷数量が表記されます。"]
["保障開始日   入力例：2023/8/9","令和5年7月10日",null,"保証開始日",{"$f":"IF(B17=\"\",\"\",B17)","v":"令和5年7月10日"}]
["保証年数",5,null,"保証年数",{"$f":"IF(B18=\"\",\"\",B18)","v":5}]
["工事名称","北浜コニシビル改修工事",null,"元請業者",{"$f":"IF(B21=\"\",\"\",B21)","v":"株式会社　小西組"}]
["現場住所","〇〇府〇〇市〇〇-〇〇",null,"施工業者",{"$f":"IF(B22=\"\",\"\",B22)","v":"Konishi.Building"}]
["元請業者","株式会社　小西組"]
["施工業者","Konishi.Building"]
[]
[]
["工事：出荷証明書用　製品名等"]
[null,null,null,"出荷日"]
["出荷日　□　選択下さい。  ",null,1,"令和5年12月19日"]
[null,null,2,"令和5年12月20日～令和5年12月22日",null,null,null,null,null,null,null,null,null,"下地補修",null,null,null,null,"下地補修",null,null,null,null,"シーリング補修",null,null,null,null,"シーリング補修"]
[null,"出荷日確認用","No","製品名（工事　補修）",null,"出荷単位",null,"出荷量",null,"Lot.No","vlook確認",null,"ＮＯ","品　　　　　名","荷姿",null,null,"ＮＯ","品　　　　　名","荷姿",null,null,"ＮＯ","品　　　　　名","荷姿",null,null,"ＮＯ","品　　　　　名","荷姿"]
["出荷日",{"$f":"IF($A$105, $D$27, IF($A$106, $D$28, \"\"))","v":"令和5年12月19日"},1,{"$f":"IF(C30=\"\",\"\",VLOOKUP(C30,VLOOK!$B$3:$N$1000,3,FALSE))","v":"ボンド　Ｅ２０６"},null,{"$f":"IF(C30=\"\", \"\", IF(VLOOKUP(C30, VLOOK!$B$3:$N$1000, 4, FALSE) = 0, \"\", VLOOKUP(C30, VLOOK!$B$3:$N$1000, 4, FALSE)))","v":3},{"$f":"IF(C30=\"\", \"\", IF(VLOOKUP(C30, VLOOK!$B$3:$N$1000, 6, FALSE) = 0, \"\", VLOOKUP(C30, VLOOK!$B$3:$N$1000, 6, FALSE)))","v":"kgset"},1,{"$f":"IF(C30=\"\", \"\", IF(VLOOKUP(C30, VLOOK!$B$3:$N$1000, 9, FALSE) = 0, \"\", VLOOKUP(C30, VLOOK!$B$3:$N$1000, 9, FALSE)))","v":"set"},"241122AA/241112BA",{"$f":"IF(C30<>\"\", IF(COUNTIF($M$30:$AC$120, C30) = 0, \"注\", \"\"), \"\")","v":""},null,"0","以下余白",null,null,null,32,"Ｋモルタル",6,"kgset",null,51,"ＭＳシール",4,"Lset",null,85,"ウレタンコーク",320,"ｍｌ"]
["出荷日",{"$f":"IF($B$105, $D$27, IF($B$106, $D$28, \"\"))","v":"令和5年12月20日～令和5年12月22日"},15,{"$f":"IF(C31=\"\",\"\",VLOOKUP(C31,VLOOK!$B$3:$N$1000,3,FALSE))","v":"ボンド　Ｅ２０９Ｓ"},null,{"$f":"IF(C31=\"\", \"\", IF(VLOOKUP(C31, VLOOK!$B$3:$N$1000, 4, FALSE) = 0, \"\", VLOOKUP(C31, VLOOK!$B$3:$N$1000, 4, FALSE)))","v":6},{"$f":"IF(C31=\"\", \"\", IF(VLOOKUP(C31, VLOOK!$B$3:$N$1000, 6, FALSE) = 0, \"\", VLOOKUP(C31, VLOOK!$B$3:$N$1000, 6, FALSE)))","v":"kgset"},2,{"$f":"IF(C31=\"\", \"\", IF(VLOOKUP(C31, VLOOK!$B$3:$N$1000, 9, FALSE) = 0, \"\", VLOOKUP(C31, VLOOK!$B$3:$N$1000, 9, FALSE)))","v":"set"},"240328AA/240329AA",{"$f":"IF(C31<>\"\", IF(COUNTIF($M$30:$AC$120, C31) = 0, \"注\", \"\"), \"\")","v":""},null,26,"Ｅ２０５",4,"kgset",null,313,"Ｐモルタル骨材",3,"kg",null,52,"ＰＳシール",4,"Lset",null,86,"　〃　アイボリー",320,"ｍｌ"]
["出荷日",{"$f":"IF($C$105, $D$27, IF($C$106, $D$28, \"\"))","v":"令和5年12月19日"},33,{"$f":"IF(C32=\"\",\"\",VLOOKUP(C32,VLOOK!$B$3:$N$1000,3,FALSE))","v":"ボンド　ユニエポ補修用プライマー"},null,{"$f":"IF(C32=\"\", \"\", IF(VLOOKUP(C32, VLOOK!$B$3:$N$1000, 4, FALSE) = 0, \"\", VLOOKUP(C32, VLOOK!$B$3:$N$1000, 4, FALSE)))","v":500},{"$f":"IF(C32=\"\", \"\", IF(VLOOKUP(C32, VLOOK!$B$3:$N$1000, 6, FALSE) = 0, \"\", VLOOKUP(C32, VLOOK!$B$3:$N$1000, 6, FALSE)))","v":"g"},3,{"$f":"IF(C32=\"\", \"\", IF(VLOOKUP(C32, VLOOK!$B$3:$N$1000, 9, FALSE) = 0, \"\", VLOOKUP(C32, VLOOK!$B$3:$N$1000, 9, FALSE)))","v":"缶"},"240328BB","",null,1,"Ｅ２０６",3,"kgset",null,33,"ユニエポ補修用プライマー",500,"g",null,53,"ビューシール６９０９",6,"Lset",null,87,"　〃　アンバー",320,"ｍｌ"]
["出荷日",{"$f":"IF($D$105, $D$27, IF($D$106, $D$28, \"\"))","v":"令和5年12月19日"},56,{"$f":"IF(C33=\"\",\"\",VLOOKUP(C33,VLOOK!$B$3:$N$1000,3,FALSE))","v":"ボンド　シールプライマー＃３８"},null,{"$f":"IF(C33=\"\", \"\", IF(VLOOKUP(C33, VLOOK!$B$3:$N$1000, 4, FALSE) = 0, \"\", VLOOKUP(C33, VLOOK!$B$3:$N$1000, 4, FALSE)))","v":500},{"$f":"IF(C33=\"\", \"\", IF(VLOOKUP(C33, VLOOK!$B$3:$N$1000, 6, FALSE) = 0, \"\", VLOOKUP(C33, VLOOK!$B$3:$N$1000, 6, FALSE)))","v":"g"},4,{"$f":"IF(C33=\"\", \"\", IF(VLOOKUP(C33, VLOOK!$B$3:$N$1000, 9, FALSE) = 0, \"\", VLOOKUP(C33, VLOOK!$B$3:$N$1000, 9, FALSE)))","v":"缶"},"240328BB","",null,2,"Ｅ２０６Ｓ",3,"kgset",null,511,"ビューシール６９０９",6,"Lset",null,402,"ＳＡシール",4,"Lset",null,88,"　〃　グレー",320,"ｍｌ"]
["出荷日",{"$f":"IF($E$105, $D$27, IF($E$106, $D$28, \"\"))","v":"令和5年12月19日"},58,{"$f":"IF(C34=\"\",\"\",VLOOKUP(C34,VLOOK!$B$3:$N$1000,3,FALSE))","v":"ボンド　シールカラーマスター　グレー"},null,{"$f":"IF(C34=\"\", \"\", IF(VLOOKUP(C34, VLOOK!$B$3:$N$1000, 4, FALSE) = 0, \"\", VLOOKUP(C34, VLOOK!$B$3:$N$1000, 4, FALSE)))","v":160},{"$f":"IF(C34=\"\", \"\", IF(VLOOKUP(C34, VLOOK!$B$3:$N$1000, 6, FALSE) = 0, \"\", VLOOKUP(C34, VLOOK!$B$3:$N$1000, 6, FALSE)))","v":"g"},5,{"$f":"IF(C34=\"\", \"\", IF(VLOOKUP(C34, VLOOK!$B$3:$N$1000, 9, FALSE) = 0, \"\", VLOOKUP(C34, VLOOK!$B$3:$N$1000, 9, FALSE)))","v":"個"},"240328BB","",null,3,"Ｅ２０６Ｗ",3,"kgset",null,512,"ウレタンコーク",320,"ml",null,406,"サイディングシール",4,"Lset",null,89,"　〃　ブラック",320,"ｍｌ"]
["出荷日",{"$f":"IF($F$105, $D$27, IF($F$106, $D$28, \"\"))","v":"令和5年12月20日～令和5年12月22日"},511,{"$f":"IF(C35=\"\",\"\",VLOOKUP(C35,VLOOK!$B$3:$N$1000,3,FALSE))","v":"ボンド　ビューシール６９０９"},null,{"$f":"IF(C35=\"\", \"\", IF(VLOOKUP(C35, VLOOK!$B$3:$N$1000, 4, FALSE) = 0, \"\", VLOOKUP(C35, VLOOK!$B$3:$N$1000, 4, FALSE)))","v":6},{"$f":"IF(C35=\"\", \"\", IF(VLOOKUP(C35, VLOOK!$B$3:$N$1000, 6, FALSE) = 0, \"\", VLOOKUP(C35, VLOOK!$B$3:$N$1000, 6, FALSE)))","v":"Lset"},1,{"$f":"IF(C35=\"\", \"\", IF(VLOOKUP(C35, VLOOK!$B$3:$N$1000, 9, FALSE) = 0, \"\", VLOOKUP(C35, VLOOK!$B$3:$N$1000, 9, FALSE)))","v":"set"},"240328AA/240329AA","",null,4,"Ｅ２０７Ｄ",3,"kgset",null,513,"　〃　アイボリー",320,"ml",null,407,"サイディングシール用カラーマスター",160,"g",null,90,"　〃　ホワイト",320,"ｍｌ"]
["出荷日",{"$f":"IF($G$105, $D$27, IF($G$106, $D$28, \"\"))","v":"令和5年12月20日～令和5年12月22日"},512,{"$f":"IF(C36=\"\",\"\",VLOOKUP(C36,VLOOK!$B$3:$N$1000,3,FALSE))","v":"ボンド　ウレタンコーク"},null,{"$f":"IF(C36=\"\", \"\", IF(VLOOKUP(C36, VLOOK!$B$3:$N$1000, 4, FALSE) = 0, \"\", VLOOKUP(C36, VLOOK!$B$3:$N$1000, 4, FALSE)))","v":320},{"$f":"IF(C36=\"\", \"\", IF(VLOOKUP(C36, VLOOK!$B$3:$N$1000, 6, FALSE) = 0, \"\", VLOOKUP(C36, VLOOK!$B$3:$N$1000, 6, FALSE)))","v":"ml"},1,{"$f":"IF(C36=\"\", \"\", IF(VLOOKUP(C36, VLOOK!$B$3:$N$1000, 9, FALSE) = 0, \"\", VLOOKUP(C36, VLOOK!$B$3:$N$1000, 9, FALSE)))","v":"本"},"240328BB","",null,5,"Ｅ２０７ＤＳ",3,"kgset",null,514,"　〃　アンバー",320,"ml",null,411,"シールプライマー＃１土木用",1,"kg",null,91,"　〃　ライトグレー",320,"ｍｌ"]
["出荷日",{"$f":"IF($H$105, $D$27, IF($H$106, $D$28, \"\"))","v":""},0,{"$f":"IF(C37=\"\",\"\",VLOOKUP(C37,VLOOK!$B$3:$N$1000,3,FALSE))","v":"以　　下　　余　　白"},null,{"$f":"IF(C37=\"\", \"\", IF(VLOOKUP(C37, VLOOK!$B$3:$N$1000, 4, FALSE) = 0, \"\", VLOOKUP(C37, VLOOK!$B$3:$N$1000, 4, FALSE)))","v":""},{"$f":"IF(C37=\"\", \"\", IF(VLOOKUP(C37, VLOOK!$B$3:$N$1000, 6, FALSE) = 0, \"\", VLOOKUP(C37, VLOOK!$B$3:$N$1000, 6, FALSE)))","v":""},null,{"$f":"IF(C37=\"\", \"\", IF(VLOOKUP(C37, VLOOK!$B$3:$N$1000, 9, FALSE) = 0, \"\", VLOOKUP(C37, VLOOK!$B$3:$N$1000, 9, FALSE)))","v":""},null,"",null,6,"Ｅ２０７ＤＷ",3,"kgset",null,515,"　〃　グレー",320,"ml",null,54,"シールプライマー＃９",500,"g",null,92,"シリコンコーク　",330,"ｍｌ"]
["出荷日",{"$f":"IF($I$105, $D$27, IF($I$106, $D$28, \"\"))","v":""},null,{"$f":"IF(C38=\"\",\"\",VLOOKUP(C38,VLOOK!$B$3:$N$1000,3,FALSE))","v":""},null,{"$f":"IF(C38=\"\", \"\", IF(VLOOKUP(C38, VLOOK!$B$3:$N$1000, 4, FALSE) = 0, \"\", VLOOKUP(C38, VLOOK!$B$3:$N$1000, 4, FALSE)))","v":""},{"$f":"IF(C38=\"\", \"\", IF(VLOOKUP(C38, VLOOK!$B$3:$N$1000, 6, FALSE) = 0, \"\", VLOOKUP(C38, VLOOK!$B$3:$N$1000, 6, FALSE)))","v":""},null,{"$f":"IF(C38=\"\", \"\", IF(VLOOKUP(C38, VLOOK!$B$3:$N$1000, 9, FALSE) = 0, \"\", VLOOKUP(C38, VLOOK!$B$3:$N$1000, 9, FALSE)))","v":""},null,"",null,7,"Ｅ２０８",3,"kgset",null,516,"　〃　ブラック",320,"ml",null,55,"シールプライマー＃７",500,"g",null,93,"　〃　アイボリー",330,"ｍｌ"]
["出荷日",{"$f":"IF($J$105, $D$27, IF($J$106, $D$28, \"\"))","v":""},null,{"$f":"IF(C39=\"\",\"\",VLOOKUP(C39,VLOOK!$B$3:$N$1000,3,FALSE))","v":""},null,{"$f":"IF(C39=\"\", \"\", IF(VLOOKUP(C39, VLOOK!$B$3:$N$1000, 4, FALSE) = 0, \"\", VLOOKUP(C39, VLOOK!$B$3:$N$1000, 4, FALSE)))","v":""},{"$f":"IF(C39=\"\", \"\", IF(VLOOKUP(C39, VLOOK!$B$3:$N$1000, 6, FALSE) = 0, \"\", VLOOKUP(C39, VLOOK!$B$3:$N$1000, 6, FALSE)))","v":""},null,{"$f":"IF(C39=\"\", \"\", IF(VLOOKUP(C39, VLOOK!$B$3:$N$1000, 9, FALSE) = 0, \"\", VLOOKUP(C39, VLOOK!$B$3:$N$1000, 9, FALSE)))","v":""},null,"",null,8,"Ｅ２０８Ｓ",3,"kgset",null,517,"　〃　ホワイト",320,"ml",null,56,"シールプライマー＃３８",500,"g",null,94,"　〃　アルミ",330,"ｍｌ"]
["出荷日",{"$f":"IF($K$105, $D$27, IF($K$106, $D$28, \"\"))","v":""},null,{"$f":"IF(C40=\"\",\"\",VLOOKUP(C40,VLOOK!$B$3:$N$1000,3,FALSE))","v":""},null,{"$f":"IF(C40=\"\", \"\", IF(VLOOKUP(C40, VLOOK!$B$3:$N$1000, 4, FALSE) = 0, \"\", VLOOKUP(C40, VLOOK!$B$3:$N$1000, 4, FALSE)))","v":""},{"$f":"IF(C40=\"\", \"\", IF(VLOOKUP(C40, VLOOK!$B$3:$N$1000, 6, FALSE) = 0, \"\", VLOOKUP(C40, VLOOK!$B$3:$N$1000, 6, FALSE)))","v":""},null,{"$f":"IF(C40=\"\", \"\", IF(VLOOKUP(C40, VLOOK!$B$3:$N$1000, 9, FALSE) = 0, \"\", VLOOKUP(C40, VLOOK!$B$3:$N$1000, 9, FALSE)))","v":""},null,"",null,9,"Ｅ２０８Ｗ",3,"kgset",null,518,"　〃　ライトグレー",320,"ml",null,57,"シールカラーマスター　",160,"g",null,95,"　〃　アンバー",330,"ｍｌ"]
["出荷日",{"$f":"IF($M$123, $D$27, IF($M$124, $D$28, \"\"))","v":""},null,{"$f":"IF(C41=\"\",\"\",VLOOKUP(C41,VLOOK!$B$3:$N$1000,3,FALSE))","v":""},null,{"$f":"IF(C41=\"\", \"\", IF(VLOOKUP(C41, VLOOK!$B$3:$N$1000, 4, FALSE) = 0, \"\", VLOOKUP(C41, VLOOK!$B$3:$N$1000, 4, FALSE)))","v":""},{"$f":"IF(C41=\"\", \"\", IF(VLOOKUP(C41, VLOOK!$B$3:$N$1000, 6, FALSE) = 0, \"\", VLOOKUP(C41, VLOOK!$B$3:$N$1000, 6, FALSE)))","v":""},null,{"$f":"IF(C41=\"\", \"\", IF(VLOOKUP(C41, VLOOK!$B$3:$N$1000, 9, FALSE) = 0, \"\", VLOOKUP(C41, VLOOK!$B$3:$N$1000, 9, FALSE)))","v":""},null,"",null,10,"Ｅ２０８ＳＳ",3,"kgset",null,34,"シリンダーセット",null,null,null,58,"　〃　グレー",160,"g",null,96,"　〃　クリヤー",330,"ｍｌ"]
["出荷日",{"$f":"IF($N$123, $D$27, IF($N$124, $D$28, \"\"))","v":""},null,{"$f":"IF(C42=\"\",\"\",VLOOKUP(C42,VLOOK!$B$3:$N$1000,3,FALSE))","v":""},null,{"$f":"IF(C42=\"\", \"\", IF(VLOOKUP(C42, VLOOK!$B$3:$N$1000, 4, FALSE) = 0, \"\", VLOOKUP(C42, VLOOK!$B$3:$N$1000, 4, FALSE)))","v":""},{"$f":"IF(C42=\"\", \"\", IF(VLOOKUP(C42, VLOOK!$B$3:$N$1000, 6, FALSE) = 0, \"\", VLOOKUP(C42, VLOOK!$B$3:$N$1000, 6, FALSE)))","v":""},null,{"$f":"IF(C42=\"\", \"\", IF(VLOOKUP(C42, VLOOK!$B$3:$N$1000, 9, FALSE) = 0, \"\", VLOOKUP(C42, VLOOK!$B$3:$N$1000, 9, FALSE)))","v":""},null,"",null,11,"Ｅ２０９",3,"kgset",null,46,"シリンダーセットミニ",null,null,null,59,"　〃　コンクリートグレー",160,"g",null,97,"　〃　グレー",330,"ｍｌ"]
["出荷日",{"$f":"IF($O$123, $D$27, IF($O$124, $D$28, \"\"))","v":""},null,{"$f":"IF(C43=\"\",\"\",VLOOKUP(C43,VLOOK!$B$3:$N$1000,3,FALSE))","v":""},null,{"$f":"IF(C43=\"\", \"\", IF(VLOOKUP(C43, VLOOK!$B$3:$N$1000, 4, FALSE) = 0, \"\", VLOOKUP(C43, VLOOK!$B$3:$N$1000, 4, FALSE)))","v":""},{"$f":"IF(C43=\"\", \"\", IF(VLOOKUP(C43, VLOOK!$B$3:$N$1000, 6, FALSE) = 0, \"\", VLOOKUP(C43, VLOOK!$B$3:$N$1000, 6, FALSE)))","v":""},null,{"$f":"IF(C43=\"\", \"\", IF(VLOOKUP(C43, VLOOK!$B$3:$N$1000, 9, FALSE) = 0, \"\", VLOOKUP(C43, VLOOK!$B$3:$N$1000, 9, FALSE)))","v":""},null,"",null,12,"Ｅ２０９Ｓ",3,"kgset",null,35,"はくりシールＯＮＥ",333,"ml",null,60,"　〃　ステンカラー",160,"g",null,98,"　〃　ステンカラー",330,"ｍｌ"]
["出荷日",{"$f":"IF($P$123, $D$27, IF($P$124, $D$28, \"\"))","v":""},null,{"$f":"IF(C44=\"\",\"\",VLOOKUP(C44,VLOOK!$B$3:$N$1000,3,FALSE))","v":""},null,{"$f":"IF(C44=\"\", \"\", IF(VLOOKUP(C44, VLOOK!$B$3:$N$1000, 4, FALSE) = 0, \"\", VLOOKUP(C44, VLOOK!$B$3:$N$1000, 4, FALSE)))","v":""},{"$f":"IF(C44=\"\", \"\", IF(VLOOKUP(C44, VLOOK!$B$3:$N$1000, 6, FALSE) = 0, \"\", VLOOKUP(C44, VLOOK!$B$3:$N$1000, 6, FALSE)))","v":""},null,{"$f":"IF(C44=\"\", \"\", IF(VLOOKUP(C44, VLOOK!$B$3:$N$1000, 9, FALSE) = 0, \"\", VLOOKUP(C44, VLOOK!$B$3:$N$1000, 9, FALSE)))","v":""},null,"",null,13,"Ｅ２０９Ｗ",3,"kgset",null,36,"はくりシールクイック",333,"ml",null,61,"　〃　ダークグレー",160,"g",null,99,"　〃　ダークアイボリー",330,"ｍｌ"]
[null,null,null,null,null,null,null,null,null,{"$f":"IF(OR(F45=\"\", H45=\"\"), \"\", F45*H45)","v":""},null,null,14,"Ｅ２０９",6,"kgset",null,37,"ＵカットＯＮＥ",333,"ml",null,62,"　〃　ニューアイボリー",160,"g",null,100,"　〃　ダークアルミ",330,"ｍｌ"]
[null,null,null,null,null,null,null,null,null,{"$f":"IF(OR(F46=\"\", H46=\"\"), \"\", F46*H46)","v":""},null,null,15,"Ｅ２０９Ｓ",6,"kgset",null,38,"エフレックスタイルワン　",2,"kg",null,63,"　〃　ニューアンバー",160,"g",null,101,"　〃　ダークブラウン",330,"ｍｌ"]
[null,null,null,null,null,null,null,null,null,null,null,null,16,"Ｅ２０９Ｗ",6,"kgset",null,39,"　〃　グレー",2,"kg",null,64,"　〃　ニューブロンズ",160,"g",null,102,"　〃　ニューブルー",330,"ｍｌ"]
[null,null,null,null,null,null,null,null,null,null,null,null,17,"Ｅ２０９ＳＳ",6,"kgset",null,40,"　〃　ダークグレー",2,"kg",null,65,"　〃　ブラック",160,"g",null,103,"　〃　ブラック",330,"ｍｌ"]
[null,null,null,null,null,null,null,null,null,null,null,null,195,"Ｅ２３０Ｇ",400,"ml",null,41,"　〃　ブラック",2,"kg",null,66,"　〃　ホワイト",160,"g",null,104,"　〃　ホワイト",330,"ｍｌ"]
[null,null,null,null,null,null,null,null,null,null,null,null,196,"Ｅ２３０Ｇ",900,"ml",null,42,"　〃　ホワイト",2,"kg",null,67,"　〃　ライトグレー",160,"g",null,105,"　〃　ライトグレー",330,"ｍｌ"]
[null,null,null,null,null,null,null,null,null,null,null,null,221,"Ｅ３８０Ｆ",8,"kgset",null,43,"　〃　ライトグレー",2,"kg",null,68,"　〃　ニューホワイト",160,"g",null,106,"ＭＳシール超耐久",4,"Ｌ"]
[null,null,null,null,null,null,null,null,null,null,null,null,225,"Ｅ３９０",6,"kgset",null,159,"ＣＰアンカーピンＥ５５０",null,null,null,69,"ＡＵシール",4,"lset",null,107,"ビルドシールＳＲ",4,"Ｌ"]
[null,null,null,null,null,null,null,null,null,null,null,null,227,"Ｅ３９５",15,"kgset",null,160,"ＣＰアンカーピンＥ５７０",null,null,null,70,"ＡＵクイック　",333,"ml",null,108,"ビルドシールＳＲ用カラーマスター　",0.27,"Ｌ"]
[null,null,null,null,null,null,null,null,null,null,null,null,229,"Ｅ３９５Ｓ",15,"kgset",null,161,"ＣＰアンカーピンＥ６１０",null,null,null,71,"ＡＵクイック　グレー",333,"ml",null,109,"　〃　ライトグレー",0.27,"Ｌ"]
[null,null,null,null,null,null,null,null,null,null,null,null,230,"Ｅ３９５Ｗ",15,"kgset",null,162,"ＣＰアンカーピンＥ６５０",null,null,null,72,"ＡＵクイック　ホワイト",333,"ml",null,110,"　〃　グレー",0.27,"Ｌ"]
[null,null,null,null,null,null,null,null,null,null,null,null,239,"Ｅ４８８",20,"kgset",null,163,"ＣＰアンカーピンＥ６７０",null,null,null,73,"ＭＳコークノンブリードＬＭ　",333,"ml",null,111,"　〃　コンクリートグレー",0.27,"Ｌ"]
[null,null,null,null,null,null,null,null,null,null,null,null,18,"Ｅ６００",10,"kgset",null,323,"ＯＧグラウト",330,"ml",null,74,"　〃　グレー",333,"ml",null,112,"　〃　ステンカラー",0.27,"Ｌ"]
[null,null,null,null,null,null,null,null,null,null,null,null,240,"Ｅ８１０Ｌ",7,"kgset",null,346,"ＶＰセメントＬ",25,"kgset",null,75,"　〃　コンクリートグレー",333,"ml",null,113,"　〃　ダークグレー",0.27,"Ｌ"]
[null,null,null,null,null,null,null,null,null,null,null,null,242,"Ｅ８１０ＬＳ",7,"kgset",null,188,"エフモル０５",12.5,"kg",null,76,"　〃　ステンカラー",333,"ml",null,114,"　〃　ニューアイボリー",0.27,"Ｌ"]
[null,null,null,null,null,null,null,null,null,null,null,null,243,"Ｅ８１０ＬＷ",7,"kgset",null,189,"エフモル０５",20,"kg",null,77,"　〃　ダークグレー",333,"ml",null,115,"　〃　ニューアンバー",0.27,"Ｌ"]
[null,null,null,null,null,null,null,null,null,null,null,null,180,"Ｅ２０００",900,"gset",null,191,"エフモル０５ＫＨ",20,"kg",null,78,"　〃　ニューアイボリー",333,"ml",null,116,"　〃　ニューブロンズ",0.27,"Ｌ"]
[null,null,null,null,null,null,null,null,null,null,null,null,181,"Ｅ２０００Ｓ",900,"gset",null,190,"エフモルＡＩ",20,"kg",null,79,"　〃　ニューアンバー",333,"ml",null,117,"　〃　ブラック",0.27,"Ｌ"]
[null,null,null,null,null,null,null,null,null,null,null,null,182,"Ｅ２０００Ｗ",900,"gset",null,192,"ＣＡＴ１８",18,"kg",null,80,"　〃　ニューブロンズ",333,"ml",null,118,"　〃　ホワイト　",0.27,"Ｌ"]
[null,null,null,null,null,null,null,null,null,null,null,null,183,"Ｅ２０００ＳＳ",900,"gset",null,287,"ＷＢ５０００",10,"kg",null,81,"　〃　ブラック",333,"ml",null,119,"ビルドシールＳＲ硬化遅延剤",200,"ｇ"]
[null,null,null,null,null,null,null,null,null,null,null,null,184,"Ｅ２０００",12,"kgset",null,288,"ビルテクト１００Ｅ",17,"kg",null,83,"　〃　ライトグレー",333,"ml",null,120,"シールプライマーシリコン用C",300,"ｍｌ"]
[null,null,null,null,null,null,null,null,null,null,null,null,185,"Ｅ２０００Ｓ",12,"kgset",null,285,"インナーテクトドライプロテクト",17,"kg",null,84,"　〃　ニューホワイト",333,"ml",null,121,"シールプライマーシリコン用Ｆ",300,"ｍｌ"]
[null,null,null,null,null,null,null,null,null,null,null,null,186,"Ｅ２０００Ｗ",12,"kgset",null,340,"ＶＭプライマー",4,"kgset",null,425,"土木用シール　極",6,"L"]
[null,null,null,null,null,null,null,null,null,null,null,null,187,"Ｅ２０００ＳＳ",12,"kgset",null,336,"ＶＭ－３中塗り",13.5,"kgset",null,427,"土木用シール　極",850,"ml"]
[null,null,null,null,null,null,null,null,null,null,null,null,27,"Ｅ２３００",15,"kgset",null,337,"ＶＭ－３中塗り希釈剤",270,"g",null,426,"土木用シール　極",320,"ml",null,null,"アクアバインド"]
["コニシ確認用",null,null,null,null,null,null,null,null,null,null,null,28,"Ｅ２３００Ｓ",15,"kgset",null,332,"ＶＭ－４",6.6,"kgset",null,417,"シールプライマー極用",500,"g",null,"ＮＯ","品　　　　　名","荷姿"]
["工事","シール",null,null,null,null,null,null,null,null,null,null,29,"Ｅ２３００Ｗ",15,"kgset",null,131,"トリネオＴＳＳ１８１０Ｙ",100,"m",null,423,"ＵＰシール＃７００グレー",8,"kgset",null,44,"アクアバインドプライマー",16,"kg"]
[{"$f":"IF(OR(AND(C30>=1, C30<=50), AND(C30>=130, C30<=399), AND(C30>=511, C30<=570)), D30&\"  \"&H30&I30, \"\")","v":"ボンド　Ｅ２０６  1set"},{"$f":"IF(OR(AND(C30>=51, C30<=121), AND(C30>=401, C30<=500)), D30&\"  \"&H30&I30, \"\")","v":""},null,null,null,null,null,null,null,null,null,null,23,"Ｅ２３７０Ｍ",15,"kgset",null,145,"トレカクロスＢＴ７０－２０－１００",50,"m",null,474,"ＥＭＳセグメントシール",8,"kgset",null,357,"アクアバインドＺⅡ",16,"kg"]
[{"$f":"B73","v":""},{"$f":"IF(OR(AND(C31>=51, C31<=121), AND(C31>=401, C31<=500)), D31&\"  \"&H31&I31, \"\")","v":""},null,null,null,null,null,null,null,null,null,null,24,"Ｅ２３７０ＭＳ",15,"kgset",null,132,"トレカクロスＵＴ７０－２０Ｇ－３３",50,"m",null,449,"耐火目地シーラント",333,"ml",null,356,"アクアトップコート",16,"kg"]
[{"$f":"IF(OR(AND(C32>=1, C32<=50), AND(C32>=130, C32<=399), AND(C32>=511, C32<=570)), D32&\"  \"&H32&I32, \"\")","v":"ボンド　ユニエポ補修用プライマー  3缶"},"",null,null,null,null,null,null,null,null,null,null,25,"Ｅ２３７０ＭＷ",15,"kgset",null,133,"トレカクロスＵＴ７０－２０Ｇ－５０",50,"m",null,451,"耐火目地シーラント　グレー",333,"ml"]
["","ボンド　シールプライマー＃３８  4缶",null,null,null,null,null,null,null,null,null,null,19,"Ｅ２３００Ｊ",15,"kgset",null,270,"フィブラメッシュＡＫＭ－５・５",1,"m",null,452,"耐火目地シーラント　ホワイト",333,"ml"]
["","ボンド　シールカラーマスター　グレー  5個",null,null,null,null,null,null,null,null,null,null,20,"Ｅ２３００ＪＳ",15,"kgset",null,257,"ＵコートＦ",18,"kgset"]
["ボンド　ビューシール６９０９  1set","",null,null,null,null,null,null,null,null,null,null,21,"Ｅ２３００ＪＷ",15,"kgset",null,259,"Ｕコートうすめ液",16,"L",null,null,"カーボピンネット",null,null,null,null,"ソルバインド"]
["ボンド　ウレタンコーク  1本","",null,null,null,null,null,null,null,null,null,null,22,"ＲＭ骨材",15,"kg",null,260,"ＡコートＦ",16.5,"kgset",null,"ＮＯ","品　　　　　名","荷姿",null,null,"ＮＯ","品　　　　　名","荷姿"]
["","",null,null,null,null,null,null,null,null,null,null,30,"Ｅ２４２０",3,"kgset",null,254,"ＦコートＦ",18,"kgset",null,44,"エフレックスＦ１",10,"kg",null,354,"ソルバインドプライマー",4,"kg"]
["","",null,null,null,null,null,null,null,null,null,null,31,"Ｅ２４２０Ｄ",3,"kgset",null,256,"ＦコートＦうすめ液",16,"L",null,45,"Ｆ１希釈剤",4,"kg",null,353,"ソルバインド中塗り",16,"kg"]
["","",null,null,null,null,null,null,null,null,null,null,200,"Ｅ２５００",15,"kgset",null,331,"ＶＭクリアプライマー",4,"kg",null,49,"カーボピンネット中塗り１材",20,"kg",null,351,"ソルバインドトップコート主剤",12,"kg"]
["","",null,null,null,null,null,null,null,null,null,null,202,"Ｅ２５００Ｓ",15,"kgset",null,330,"ＶＭクリア",6,"kgset",null,50,"ＶＭネット",100,"m",null,352,"ソルバインドトップコート硬化剤",3,"kg"]
["","",null,null,null,null,null,null,null,null,null,null,203,"Ｅ２５００Ｗ",15,"kgset",null,329,"ＶＭネットレス下塗り",4,"kg",null,158,"ＣＰアンカーピンＡＬ６７０"]
["","",null,null,null,null,null,null,null,null,null,null,205,"Ｅ２６０１",3,"kgset",null,328,"ＶＭネットレス中塗り",16,"kgset",null,164,"ＣＰアンカーピンＮ５３０"]
["","",null,null,null,null,null,null,null,null,null,null,207,"Ｅ２６０１Ｓ",3,"kgset",null,326,"ＡＵトップ",18,"㎏",null,165,"ＣＰアンカーピンＮ５５０"]
["","",null,null,null,null,null,null,null,null,null,null,208,"Ｅ２６０１Ｗ",3,"kgset",null,327,"ＡＵトップうすめ液",16,"L",null,166,"ＣＰアンカーピンＮ５７０"]
["","",null,null,null,null,null,null,null,null,null,null,214,"Ｅ２９００Ｊ",15,"kgset",null,339,"ＨＳネット",100,"m",null,167,"ＣＰアンカーピンＮ６１０"]
[null,null,null,null,null,null,null,null,null,null,null,null,216,"Ｅ２９００ＪＳ",15,"kgset",null,314,"マイクロクラック補修用プライマー",600,"g",null,168,"ＣＰアンカーピンＮ６５０"]
[null,null,null,null,null,null,null,null,null,null,null,null,217,"Ｅ２９００ＪＷ",15,"kgset",null,null,null,null,null,null,169,"ＣＰアンカーピンＮ６７０"]
[null,null,null,null,null,null,null,null,null,null,null,null,218,"Ｅ２９００Ｊ",6,"kgset",null,null,null,null,null,null,170,"ＣＰキャップ６．５"]
[{"$f":"IF(A72<>\"\", A72, \"\") & IF(AND(A73<>\"\",A72<>\"\"), \"､\" & A73, A73) & IF(AND(A74<>\"\",A73<>\"\"), \"､\" & A74, A74) & IF(AND(A75<>\"\",A74<>\"\"), \"､\" & A75, A75) & IF(AND(A76<>\"\",A75<>\"\"), \"､\" & A76, A76) & IF(AND(A77<>\"\",A76<>\"\"), \"､\" & A77, A77) & IF(AND(A78<>\"\",A77<>\"\"), \"､\" & A78, A78) & IF(AND(A79<>\"\",A78<>\"\"), \"､\" & A79, A79) & IF(AND(A80<>\"\",A79<>\"\"), \"､\" & A80, A80) & IF(AND(A81<>\"\",A80<>\"\"), \"､\" & A81, A81) & IF(AND(A82<>\"\",A81<>\"\"), \"､\" & A82, A82) & IF(AND(A83<>\"\",A82<>\"\"), \"､\" & A83, A83) & IF(AND(A84<>\"\",A83<>\"\"), \"､\" & A84, A84) & IF(AND(A85<>\"\",A84<>\"\"), \"､\" & A85, A85) & IF(AND(A86<>\"\",A85<>\"\"), \"､\" & A86, A86) & IF(AND(A87<>\"\",A86<>\"\"), \"､\" & A87, A87)","v":"ボンド　Ｅ２０６  1setボンド　ユニエポ補修用プライマー  3缶ボンド　ビューシール６９０９  1set､ボンド　ウレタンコーク  1本"},{"$f":"IF(B72<>\"\", B72, \"\") & IF(AND(B73<>\"\",B72<>\"\"), \"､\" & B73, B73) & IF(AND(B74<>\"\",B73<>\"\"), \"､\" & B74, B74) & IF(AND(B75<>\"\",B74<>\"\"), \"､\" & B75, B75) & IF(AND(B76<>\"\",B75<>\"\"), \"､\" & B76, B76) & IF(AND(B77<>\"\",B76<>\"\"), \"､\" & B77, B77) & IF(AND(B78<>\"\",B77<>\"\"), \"､\" & B78, B78) & IF(AND(B79<>\"\",B78<>\"\"), \"､\" & B79, B79) & IF(AND(B80<>\"\",B79<>\"\"), \"､\" & B80, B80) & IF(AND(B81<>\"\",B80<>\"\"), \"､\" & B81, B81) & IF(AND(B82<>\"\",B81<>\"\"), \"､\" & B82, B82) & IF(AND(B83<>\"\",B82<>\"\"), \"､\" & B83, B83) & IF(AND(B84<>\"\",B83<>\"\"), \"､\" & B84, B84) & IF(AND(B85<>\"\",B84<>\"\"), \"､\" & B85, B85) & IF(AND(B86<>\"\",B85<>\"\"), \"､\" & B86, B86) & IF(AND(B87<>\"\",B86<>\"\"), \"､\" & B87, B87)","v":"ボンド　シールプライマー＃３８  4缶､ボンド　シールカラーマスター　グレー  5個"},null,null,null,null,null,null,null,null,null,null,219,"Ｅ２９００ＪＳ",6,"kgset",null,null,null,null,null,null,171,"ＣＰキャップ９．０"]
[null,null,null,null,null,null,null,null,null,null,null,null,220,"Ｅ２９００ＪＷ",6,"kgset"]
[]
[{"$f":"CONCATENATE(A72, \" \", B72, \"、\", A73, \" \", B73, \"、\", A74, \" \", B74, \"、\", A75, \" \", B75, \"、\", A76, \" \", B76, \"、\", A77, \" \", B77, \"、\", A78, \" \", B78, \"、\", A79, \" \", B79, \"、\", A80, \" \", B80, \"、\", A81, \" \", B81, \"、\", A82, \" \", B82, \"、\", A83, \" \", B83, \"、\", A84, \" \", B84, \"、\", A85, \" \", B85, \"、\", A86, \" \", B86, \"、\", A87, \" \", B87)","v":"ボンド　Ｅ２０６  1set 、 、ボンド　ユニエポ補修用プライマー  3缶 、 ボンド　シールプライマー＃３８  4缶、 ボンド　シールカラーマスター　グレー  5個、ボンド　ビューシール６９０９  1set 、ボンド　ウレタンコーク  1本 、 、 、 、 、 、 、 、 、 "}]
[]
[]
[]
[]
[]
[]
[]
[]
[]
[]
[true,false,true,true,true,false,null,false,false]
[false,true,false,false,false,true,true]
[null,null,null,null,true,null,null,null,false]
[]
[]
[]
[true]
[]
[]
[]
[]
[]
[]
[]
[]
[]
[]
[]
[]
[null,null,null,null,null,null,null,null,null,null,null,null,false]

{"sheet":"出荷証明書 ","index":2,"n_rows":36,"n_cols":16,"rows_kept":36,"cut":false,"hidden":false,"merged":[[31,7,31,11],[32,7,32,11],[29,2,29,6],[30,2,30,6],[31,2,31,6],[32,2,32,6],[29,7,29,11],[30,7,30,11],[19,7,19,11],[20,7,20,11],[21,7,21,11],[22,7,22,11],[23,7,23,11],[25,2,25,6],[26,2,26,6],[27,2,27,6],[28,2,28,6],[24,7,24,11],[25,7,25,11],[26,7,26,11],[27,7,27,11],[28,7,28,11],[18,2,18,6],[18,7,18,11],[25,0,25,1],[18,0,18,1],[19,0,19,1],[20,0,20,1],[21,0,21,1],[22,0,22,1],[23,0,23,1],[24,0,24,1],[19,2,19,6],[20,2,20,6],[21,2,21,6],[22,2,22,6],[23,2,23,6],[24,2,24,6],[31,0,31,1],[32,0,32,1],[26,0,26,1],[27,0,27,1],[28,0,28,1],[29,0,29,1],[30,0,30,1],[17,12,17,13],[17,14,17,15],[5,0,5,15],[7,0,7,15],[10,0,10,15],[11,0,11,15],[12,1,12,15],[13,1,13,15],[14,1,14,15],[15,1,15,15],[17,0,17,1],[17,7,17,11],[17,2,17,6],[0,12,0,13],[0,14,0,15],[3,0,3,15],[1,9,1,15],[16,0,16,15],[8,10,8,15]]}
[null,null,null,null,null,null,null,null,null,null,null,null,{"$f":"IF(入力!B2=\"\",\"\",入力!B2)","v":""}]
[null,null,null,null,null,null,null,null,null,{"$f":"IF(入力!B14=\"\",\"　　年　　月　　日\",入力!B14)","v":"　　年　　月　　日"}]
[]
["出荷証明書"]
[]
[{"$f":"IF(入力!B15=\"\",\"　　　　　　　　\"&IF(入力!B16=\"\",\"\",入力!B16),入力!B15&\"　\"&IF(入力!B16=\"\",\"\",入力!B16))","v":"田中　一郎　プルダウンより選択ください"}]
[]
[]
[]
[]
[]
[]
["工 事 名 称",{"$f":"IF(入力!B19=0,\"\",入力!B19)&\"\"","v":"北浜コニシビル改修工事"}]
["（ 現 場 名 ）"]
["元 請 業 者",{"$f":"IF(入力!B21=0,\"\",入力!B21)&\"\"","v":"株式会社　小西組"}]
["施 工 業 者",{"$f":"IF(入力!B22=0,\"\",入力!B22)&\"\"","v":"Konishi.Building"}]
["  納 入 明 細"]
["出荷年月日",null,"品　　　　　　　　　　　名",null,null,null,null,"Lot No.",null,null,null,null,"出荷単位",null,"出荷量"]
[{"$f":"IF(入力!B30=0,\"\",入力!B30)","v":"令和5年12月19日"},null,{"$f":"IF(入力!C30=\"\",\"\",VLOOKUP(入力!C30,VLOOK!$B$3:$N$573,3,FALSE) )","v":"ボンド　Ｅ２０６"},null,null,null,null,{"$f":" IF(入力!J30=\"\", \"\", 入力!J30)","v":"241122AA/241112BA"},null,null,null,null,{"$f":"入力!F30","v":3},{"$f":"入力!G30","v":"kgset"},{"$f":"IF(入力!H30=\"\",\"\",入力!H30)","v":1},{"$f":"入力!I30","v":"set"}]
[{"$f":"IF(入力!B31=0,\"\",入力!B31)","v":"令和5年12月20日～令和5年12月22日"},null,{"$f":"IF(入力!C31=\"\",\"\",VLOOKUP(入力!C31,VLOOK!$B$3:$N$573,3,FALSE) )","v":"ボンド　Ｅ２０９Ｓ"},null,null,null,null,{"$f":" IF(入力!J31=\"\", \"\", 入力!J31)","v":"240328AA/240329AA"},null,null,null,null,{"$f":"入力!F31","v":6},{"$f":"入力!G31","v":"kgset"},{"$f":"IF(入力!H31=\"\",\"\",入力!H31)","v":2},{"$f":"入力!I31","v":"set"}]
[{"$f":"IF(入力!B32=0,\"\",入力!B32)","v":"令和5年12月19日"},null,{"$f":"IF(入力!C32=\"\",\"\",VLOOKUP(入力!C32,VLOOK!$B$3:$N$573,3,FALSE) )","v":"ボンド　ユニエポ補修用プライマー"},null,null,null,null,{"$f":" IF(入力!J32=\"\", \"\", 入力!J32)","v":"240328BB"},null,null,null,null,{"$f":"入力!F32","v":500},{"$f":"入力!G32","v":"g"},{"$f":"IF(入力!H32=\"\",\"\",入力!H32)","v":3},{"$f":"入力!I32","v":"缶"}]
[{"$f":"IF(入力!B33=0,\"\",入力!B33)","v":"令和5年12月19日"},null,{"$f":"IF(入力!C33=\"\",\"\",VLOOKUP(入力!C33,VLOOK!$B$3:$N$573,3,FALSE) )","v":"ボンド　シールプライマー＃３８"},null,null,null,null,{"$f":" IF(入力!J33=\"\", \"\", 入力!J33)","v":"240328BB"},null,null,null,null,{"$f":"入力!F33","v":500},{"$f":"入力!G33","v":"g"},{"$f":"IF(入力!H33=\"\",\"\",入力!H33)","v":4},{"$f":"入力!I33","v":"缶"}]
[{"$f":"IF(入力!B34=0,\"\",入力!B34)","v":"令和5年12月19日"},null,{"$f":"IF(入力!C34=\"\",\"\",VLOOKUP(入力!C34,VLOOK!$B$3:$N$573,3,FALSE) )","v":"ボンド　シールカラーマスター　グレー"},null,null,null,null,{"$f":" IF(入力!J34=\"\", \"\", 入力!J34)","v":"240328BB"},null,null,null,null,{"$f":"入力!F34","v":160},{"$f":"入力!G34","v":"g"},{"$f":"IF(入力!H34=\"\",\"\",入力!H34)","v":5},{"$f":"入力!I34","v":"個"}]
[{"$f":"IF(入力!B35=0,\"\",入力!B35)","v":"令和5年12月20日～令和5年12月22日"},null,{"$f":"IF(入力!C35=\"\",\"\",VLOOKUP(入力!C35,VLOOK!$B$3:$N$573,3,FALSE) )","v":"ボンド　ビューシール６９０９"},null,null,null,null,{"$f":" IF(入力!J35=\"\", \"\", 入力!J35)","v":"240328AA/240329AA"},null,null,null,null,{"$f":"入力!F35","v":6},{"$f":"入力!G35","v":"Lset"},{"$f":"IF(入力!H35=\"\",\"\",入力!H35)","v":1},{"$f":"入力!I35","v":"set"}]
[{"$f":"IF(入力!B36=0,\"\",入力!B36)","v":"令和5年12月20日～令和5年12月22日"},null,{"$f":"IF(入力!C36=\"\",\"\",VLOOKUP(入力!C36,VLOOK!$B$3:$N$573,3,FALSE) )","v":"ボンド　ウレタンコーク"},null,null,null,null,{"$f":" IF(入力!J36=\"\", \"\", 入力!J36)","v":"240328BB"},null,null,null,null,{"$f":"入力!F36","v":320},{"$f":"入力!G36","v":"ml"},{"$f":"IF(入力!H36=\"\",\"\",入力!H36)","v":1},{"$f":"入力!I36","v":"本"}]
[{"$f":"IF(入力!B37=0,\"\",入力!B37)","v":""},null,{"$f":"IF(入力!C37=\"\",\"\",VLOOKUP(入力!C37,VLOOK!$B$3:$N$573,3,FALSE) )","v":"以　　下　　余　　白"},null,null,null,null,{"$f":" IF(入力!J37=\"\", \"\", 入力!J37)","v":""},null,null,null,null,{"$f":"入力!F37","v":""},{"$f":"入力!G37","v":""},{"$f":"IF(入力!H37=\"\",\"\",入力!H37)","v":""},{"$f":"入力!I37","v":""}]
[{"$f":"IF(入力!B38=0,\"\",入力!B38)","v":""},null,{"$f":"IF(入力!C38=\"\",\"\",VLOOKUP(入力!C38,VLOOK!$B$3:$N$573,3,FALSE) )","v":""},null,null,null,null,{"$f":" IF(入力!J38=\"\", \"\", 入力!J38)","v":""},null,null,null,null,{"$f":"入力!F38","v":""},{"$f":"入力!G38","v":""},{"$f":"IF(入力!H38=\"\",\"\",入力!H38)","v":""},{"$f":"入力!I38","v":""}]
[{"$f":"IF(入力!B39=0,\"\",入力!B39)","v":""},null,{"$f":"IF(入力!C39=\"\",\"\",VLOOKUP(入力!C39,VLOOK!$B$3:$N$573,3,FALSE) )","v":""},null,null,null,null,{"$f":" IF(入力!J39=\"\", \"\", 入力!J39)","v":""},null,null,null,null,{"$f":"入力!F39","v":""},{"$f":"入力!G39","v":""},{"$f":"IF(入力!H39=\"\",\"\",入力!H39)","v":""},{"$f":"入力!I39","v":""}]
[{"$f":"IF(入力!B40=0,\"\",入力!B40)","v":""},null,{"$f":"IF(入力!C40=\"\",\"\",VLOOKUP(入力!C40,VLOOK!$B$3:$N$573,3,FALSE) )","v":""},null,null,null,null,{"$f":" IF(入力!J40=\"\", \"\", 入力!J40)","v":""},null,null,null,null,{"$f":"入力!F40","v":""},{"$f":"入力!G40","v":""},{"$f":"IF(入力!H40=\"\",\"\",入力!H40)","v":""},{"$f":"入力!I40","v":""}]
[{"$f":"IF(入力!B41=0,\"\",入力!B41)","v":""},null,{"$f":"IF(入力!C41=\"\",\"\",VLOOKUP(入力!C41,VLOOK!$B$3:$N$573,3,FALSE) )","v":""},null,null,null,null,{"$f":" IF(入力!J41=\"\", \"\", 入力!J41)","v":""},null,null,null,null,{"$f":"入力!F41","v":""},{"$f":"入力!G41","v":""},{"$f":"IF(入力!H41=\"\",\"\",入力!H41)","v":""},{"$f":"入力!I41","v":""}]
[{"$f":"IF(入力!B42=0,\"\",入力!B42)","v":""},null,{"$f":"IF(入力!C42=\"\",\"\",VLOOKUP(入力!C42,VLOOK!$B$3:$N$573,3,FALSE) )","v":""},null,null,null,null,{"$f":" IF(入力!J42=\"\", \"\", 入力!J42)","v":""},null,null,null,null,{"$f":"入力!F42","v":""},{"$f":"入力!G42","v":""},{"$f":"IF(入力!H42=\"\",\"\",入力!H42)","v":""},{"$f":"入力!I42","v":""}]
[{"$f":"IF(入力!B43=0,\"\",入力!B43)","v":""},null,{"$f":"IF(入力!C43=\"\",\"\",VLOOKUP(入力!C43,VLOOK!$B$3:$N$573,3,FALSE) )","v":""},null,null,null,null,{"$f":" IF(入力!J43=\"\", \"\", 入力!J43)","v":""},null,null,null,null,{"$f":"入力!F43","v":""},{"$f":"入力!G43","v":""},{"$f":"IF(入力!H43=\"\",\"\",入力!H43)","v":""},{"$f":"入力!I43","v":""}]
[{"$f":"IF(入力!B44=0,\"\",入力!B44)","v":""},null,{"$f":"IF(入力!C44=\"\",\"\",VLOOKUP(入力!C44,VLOOK!$B$3:$N$573,3,FALSE) )","v":""},null,null,null,null,{"$f":" IF(入力!J44=\"\", \"\", 入力!J44)","v":""},null,null,null,null,{"$f":"入力!F44","v":""},{"$f":"入力!G44","v":""},{"$f":"IF(入力!H44=\"\",\"\",入力!H44)","v":""},{"$f":"入力!I44","v":""}]
["上記の通り出荷しました事を証明いたします。"]
[]
[null,null,null,{"$f":"IF(入力!B44=0,\"\",入力!B44)&\"\"","v":""}]

{"sheet":"工事　保証書","index":3,"n_rows":43,"n_cols":11,"rows_kept":43,"cut":false,"hidden":false,"merged":[[0,0,1,8],[20,1,20,8],[21,1,21,8],[5,6,5,7],[4,7,4,8],[11,1,11,4],[10,1,10,4],[19,1,19,8],[12,1,12,4],[13,1,13,4],[14,1,14,4],[15,1,15,4],[18,1,18,8]]}
["保　　証　　書"]
[]
[]
[null,null,null,null,null,null,null,{"$f":"IF(入力!B2=\"\",\"\",入力!B2)","v":""}]
[null,null,null,null,null,null,null,{"$f":"IF(入力!B14=\"\",\"　　年　　月　　日\",入力!B14)","v":"　　年　　月　　日"}]
[]
[]
[null,{"$f":"IF(入力!B15=\"\",\"　　　　　　　　\"&IF(入力!B16=\"\",\"\",入力!B16),入力!B15&\"　\"&IF(入力!B16=\"\",\"\",入力!B16))","v":"田中　一郎　プルダウンより選択ください"}]
["                                                             "]
[]
[null,"工　　事　　名　　称",null,null,null,null,"：",{"$f":"IF(入力!E2=\"\", \"\", SUBSTITUTE(入力!E2, CHAR(10), CHAR(10) & CHAR(13)))","v":"北浜コニシビル改修工事"}]
[null,"現　　場　　住　　所",null,null,null,null,"：",{"$f":"IF(入力!E3=\"\", \"\", SUBSTITUTE(入力!E3, CHAR(10), CHAR(10) & CHAR(13)))","v":"〇〇府〇〇市〇〇-〇〇"}]
[null,"施　　工　　箇　　所",null,null,null,null,"：",{"$f":"IF(入力!E4=\"\", \"\", SUBSTITUTE(入力!E4, CHAR(10), CHAR(10) & CHAR(13)))","v":"外壁"}]
[null,"施工仕様・施工量",null,null,null,null,"：",{"$f":"IF(入力!E5=\"\", \"\", SUBSTITUTE(入力!E5, CHAR(10), CHAR(10) & CHAR(13)))","v":"プルダウンより選択ください。"}]
[null,"使用材料・使用量",null,null,null,null,"：",{"$f":"IF(入力!A91=\"\", \"\", SUBSTITUTE(入力!A91, CHAR(10), CHAR(10) & CHAR(13)))","v":"ボンド　Ｅ２０６  1setボンド　ユニエポ補修用プライマー  3缶ボンド　ビューシール６９０９  1set､ボンド　ウレタンコーク  1本"}]
[null,"保　　証　　期　　間",null,null,null,null,"：",{"$f":"IF(入力!E17=\"\", \"\",入力!E17&\" より \"&入力!E18&\"年間\")","v":"令和5年7月10日 より 5年間"}]
[]
[]
[null,"　上記工事に関し、保証期間内に施工箇所に欠陥等が生じた場合、当事者が立会って"]
[null,"原因を調査し、協議の上、当方に過失のある場合は該当箇所を施工についての欠陥は"]
[null,"甲と乙が、又丙の材料に関しての欠陥は丙がそれぞれ補修責任を負担いたします。"]
[null,"但し、下記の事項につきましては、免責とさせて頂きます。"]
[]
[null,null,null,"（１）","天変地異、及びその他不可抗力による場合。"]
[null,null,null,"（２）","構造上及び設計上の欠陥に起因する場合。"]
[null,null,null,"（３）","材料の許容性能を超えて使用された場合。"]
[null,null,null,"（４）","施工部位外で生じた事故及び故意の損傷による場合。"]
[null,null,null,"（５）","原因究明が通常の方法によっては困難と認められる場合。"]
[]
[]
[null,null,"（甲）元請業者",null,null,null,null,null,null,null,{"$f":"IF(入力!E9=0,\"\",入力!E9)&\"\"","v":"株式会社　小西組"}]
[]
[]
[]
[]
[]
[null,null,"（乙）施工業者",null,null,null,null,null,null,null,{"$f":"IF(入力!E10=0,\"\",入力!E10)&\"\"","v":"Konishi.Building"}]
[]
[]
[]
[]
[]
[null,null,"（丙）材料製造業者"]

{"sheet":"シール　保証書","index":4,"n_rows":46,"n_cols":13,"rows_kept":46,"cut":false,"hidden":false,"merged":[[0,0,1,8],[20,1,20,8],[21,1,21,8],[5,6,5,7],[10,1,10,4],[11,1,11,4],[12,1,12,4],[16,1,16,4],[13,1,13,4],[14,1,14,4],[15,1,15,4],[19,1,19,8],[4,7,4,8]]}
["保　　証　　書",null,null,null,null,null,null,null,null,null,null,null,{"$f":"'シール　保証書'!H4","v":""}]
[]
[]
[null,null,null,null,null,null,null,{"$f":"IF(入力!B2=\"\",\"\",入力!B2)","v":""}]
[null,null,null,null,null,null,null,{"$f":"IF(入力!B14=\"\",\"　　年　　月　　日\",入力!B14)","v":"　　年　　月　　日"}]
[]
[]
[null,{"$f":"IF(入力!B15=\"\",\"　　　　　　　　\"&IF(入力!B16=\"\",\"\",入力!B16),入力!B15&\"　\"&IF(入力!B16=\"\",\"\",入力!B16))","v":"田中　一郎　プルダウンより選択ください"}]
["                                                    "]
[]
[null,"工　　事　　名　　称",null,null,null,null,"：",{"$f":"IF(入力!E12=\"\", \"\", SUBSTITUTE(入力!E12, CHAR(10), CHAR(10) & CHAR(13)))","v":"北浜コニシビル改修工事"}]
[null,"現　　場　　住　　所",null,null,null,null,"：",{"$f":"IF(入力!E13=\"\", \"\", SUBSTITUTE(入力!E13, CHAR(10), CHAR(10) & CHAR(13)))","v":"〇〇府〇〇市〇〇-〇〇"}]
[null,"施　　工　　箇　　所",null,null,null,null,"：",{"$f":"IF(入力!E14=\"\", \"\", SUBSTITUTE(入力!E14, CHAR(10), CHAR(10) & CHAR(13)))","v":"外壁タイル目地・サッシ廻り・笠木取合い・打継・トップライトガラス・建具周り"}]
[null,"施工仕様・施工量",null,null,null,null,"：","シーリング工事"]
[null,"使用材料・使用量",null,null,null,null,"：",{"$f":"IF(入力!B91=\"\", \"\", SUBSTITUTE(入力!B91, CHAR(10), CHAR(10) & CHAR(13)))","v":"ボンド　シールプライマー＃３８  4缶､ボンド　シールカラーマスター　グレー  5個"}]
[null,"保　　証　　内　　容",null,null,null,null,"：","防水機能の維持（漏水に至るはく離・破断を生じないこと）"]
[null,"保　　証　　期　　間",null,null,null,null,"：",{"$f":"IF(入力!E17=\"\", \"\",入力!E17&\" より \"&入力!E18&\"年間\")","v":"令和5年7月10日 より 5年間"}]
[]
[]
[null,"　上記シーリング工事に関し、防水保証期間内にシーリング材のはく離・破断が原因で、"]
[null,"室内漏水事故が生じた場合、当事者が立会って原因を調査し,協議の上、当方に過失"]
[null,"のある場合は該当箇所を、施工についての欠陥は甲と乙が、又丙の材料に関しての"]
[null,"欠陥は丙がそれぞれ補修責任を負担いたします。"]
[null,"但し、下記の事項につきましては、免責とさせて頂きます。"]
[]
[null,null,null,"（１）","天変地異、及びその他不可抗力による場合。"]
[null,null,null,"（２）","構造上及び設計上の欠陥に起因する場合。"]
[null,null,null,"（３）","材料の許容性能を超えて使用された場合。"]
[null,null,null,"（４）","施工部位外で生じた事故及び故意の損傷による場合。"]
[null,null,null,"（５）","原因究明が通常の方法によっては困難と認められる場合。"]
[]
[]
[null,null,"（甲）元請業者",null,null,null,null,null,null,null,{"$f":"IF(入力!E9=0,\"\",入力!E9)&\"\"","v":"株式会社　小西組"}]
[]
[]
[]
[]
[]
[null,null,"（乙）施工業者",null,null,null,null,null,null,null,{"$f":"IF(入力!E10=0,\"\",入力!E10)&\"\"","v":"Konishi.Building"}]
[]
[]
[]
[]
[]
[]
[null,null,"（丙）材料製造業者"]

{"sheet":"VLOOK","index":5,"n_rows":573,"n_cols":14,"rows_kept":573,"cut":false,"hidden":false,"merged":[]}
[null,1,2,3,4,5,6,7,8,9,10,11,12,13]
[null,"ＮＯ","コード","品　　　　　名","荷姿",null,null,"出荷単位",null,null,null,"出荷量"]
[null,0,1,"以　　下　　余　　白"]
["え２０６ｓ*",1,"1156015003*","ボンド　Ｅ２０６",3,null,"kgset",null,null,"set",{"$f":"E4*H4","v":0},null,{"$f":"IF(D4=\"\",\"\",G4)","v":"kgset"},{"$f":"IF(D4=\"\",\"\",G4)","v":"kgset"}]
["え２０６ｓ",2,1156015003,"ボンド　Ｅ２０６Ｓ",3,null,"kgset",null,null,"set",0,null,"kgset","kgset"]
["え２０６ｗ",3,1156090003,"ボンド　Ｅ２０６Ｗ",3,null,"kgset",null,null,"set",0,null,"kgset","kgset"]
["え２０７ｄｓ*",4,"1156190003*","ボンド　Ｅ２０７Ｄ",3,null,"kgset",null,null,"set",0,null,"kgset","kgset"]
["え２０７ｄｓ",5,1156190003,"ボンド　Ｅ２０７ＤＳ",3,null,"kgset",null,null,"set",0,null,"kgset","kgset"]
["え２０７ｄｗ",6,1156641003,"ボンド　Ｅ２０７ＤＷ",3,null,"kgset",null,null,"set",0,null,"kgset","kgset"]
["え２０８ｓ*",7,"1156063003*","ボンド　Ｅ２０８",3,null,"kgset",null,null,"set",0,null,"kgset","kgset"]
["え２０８ｓ",8,1156063003,"ボンド　Ｅ２０８Ｓ",3,null,"kgset",null,null,"set",0,null,"kgset","kgset"]
["え２０８ｗ",9,1156093003,"ボンド　Ｅ２０８Ｗ",3,null,"kgset",null,null,"set",0,null,"kgset","kgset"]
[null,10,1156064003,"ボンド　Ｅ２０８ＳＳ",3,null,"kgset",null,null,"set",{"$f":"E13*H13","v":0},null,{"$f":"IF(D13=\"\",\"\",G13)","v":"kgset"},{"$f":"IF(D13=\"\",\"\",G13)","v":"kgset"}]
["え２０９ｓ３*",11,"1156045003*","ボンド　Ｅ２０９",3,null,"kgset",null,null,"set",0,null,"kgset","kgset"]
["え２０９ｓ３",12,1156045003,"ボンド　Ｅ２０９Ｓ",3,null,"kgset",null,null,"set",0,null,"kgset","kgset"]
["え２０９ｗ３",13,1156042003,"ボンド　Ｅ２０９Ｗ",3,null,"kgset",null,null,"set",0,null,"kgset","kgset"]
["え２０９ｓ６*",14,"1156045006*","ボンド　Ｅ２０９",6,null,"kgset",null,null,"set",0,null,"kgset","kgset"]
["え２０９ｓ６",15,1156045006,"ボンド　Ｅ２０９Ｓ",6,null,"kgset",null,null,"set",0,null,"kgset","kgset"]
["え２０９ｗ６",16,1156182006,"ボンド　Ｅ２０９Ｗ",6,null,"kgset",null,null,"set",0,null,"kgset","kgset"]
[null,17,1156195006,"ボンド　Ｅ２０９ＳＳ",6,null,"kgset",null,null,"set",{"$f":"E20*H20","v":0},null,{"$f":"IF(D20=\"\",\"\",G20)","v":"kgset"},{"$f":"IF(D20=\"\",\"\",G20)","v":"kgset"}]
["え６００",18,1156442410,"ボンド　Ｅ６００",10,null,"kgset",null,null,"set",0,null,"kgset","kgset"]
["え２３００ｊｓ*",19,"1157021015*","ボンド　Ｅ２３００Ｊ",15,null,"kgset",null,null,"set",0,null,"kgset","kgset"]
["え２３００ｊｓ",20,1157021015,"ボンド　Ｅ２３００ＪＳ",15,null,"kgset",null,null,"set",0,null,"kgset","kgset"]
["え２３００ｊｗ",21,1157027015,"ボンド　Ｅ２３００ＪＷ",15,null,"kgset",null,null,"set",0,null,"kgset","kgset"]
["1157414015",22,1157414015,"ボンド　ＲＭ骨材",15,null,"kg",null,null,"袋",0,null,"kg","kg"]
["え２３７０ｍｓ*",23,"1157096015*","ボンド　Ｅ２３７０Ｍ",15,null,"kgset",null,null,"set",0,null,"kgset","kgset"]
["え２３７０ｍｓ",24,1157096015,"ボンド　Ｅ２３７０ＭＳ",15,null,"kgset",null,null,"set",0,null,"kgset","kgset"]
["え２３７０ｍｗ",25,1157099015,"ボンド　Ｅ２３７０ＭＷ",15,null,"kgset",null,null,"set",0,null,"kgset","kgset"]
["え２０５",26,1156623004,"ボンド　Ｅ２０５",4,null,"kgset",null,null,"set",0,null,"kgset","kgset"]
["え２３００ｓ*",27,"1157078415*","ボンド　Ｅ２３００",15,null,"kgset",null,null,"set",0,null,"kgset","kgset"]
["え２３００ｓ",28,1157078415,"ボンド　Ｅ２３００Ｓ",15,null,"kgset",null,null,"set",0,null,"kgset","kgset"]
["え２３００ｗ",29,1157108415,"ボンド　Ｅ２３００Ｗ",15,null,"kgset",null,null,"set",0,null,"kgset","kgset"]
["え２４２０３",30,1157111003,"ボンド　Ｅ２４２０",3,null,"kgset",null,null,"set",0,null,"kgset","kgset"]
["え２４２０ｄ",31,1157138003,"ボンド　Ｅ２４２０D",3,null,"kgset",null,null,"set",0,null,"kgset","kgset"]
["ｋ",32,1157527108,"ボンド　Ｋモルタル",6,null,"kgset",null,null,"set",0,null,"kgset","kgset"]
["ゆに",33,1156534250,"ボンド　ユニエポ補修用プライマー",500,null,"g",null,null,"缶",0,null,"g","g"]
["しりんだ",34,1371707000,"ボンド　シリンダーセット",null,null,null,null,null,null,{"$f":"IF(A37=\"\",\"\",E37*H37)","v":0},null,"個","個"]
["はく",35,1154092333,"ボンド　はくりシールＯＮＥ",333,null,"ml",null,null,"本",{"$f":"E38*H38","v":0},null,{"$f":"IF(D38=\"\",\"\",G38)","v":"ml"},{"$f":"IF(D38=\"\",\"\",G38)","v":"ml"}]
[null,36,1154126333,"ボンド　はくりシールクイック",333,null,"ml",null,null,"本",{"$f":"E39*H39","v":0},null,{"$f":"IF(D39=\"\",\"\",G39)","v":"ml"},{"$f":"IF(D39=\"\",\"\",G39)","v":"ml"}]
["う",37,1156555333,"ボンド　ＵカットＯＮＥ",333,null,"ml",null,null,"本",0,null,"ml","ml"]
["たいるぐれ*",38,"1159805002*","ボンド　エフレックスタイルワン　",2,null,"kg",null,null,"本",0,null,"kg","kg"]
["たいるぐれ",39,1159805002,"ボンド　エフレックスタイルワン　グレー",2,null,"kg",null,null,"本",0,null,"kg","kg"]
["たいるだくぐれ",40,1159798002,"ボンド　エフレックスタイルワン　ダークグレー",2,null,"kg",null,null,"本",0,null,"kg","kg"]
["たいるぶら",41,1159780002,"ボンド　エフレックスタイルワン　ブラック",2,null,"kg",null,null,"本",0,null,"kg","kg"]
["たいるほわ",42,1159804002,"ボンド　エフレックスタイルワン　ホワイト",2,null,"kg",null,null,"本",0,null,"kg","kg"]
["たいるらいとぐ",43,1159796002,"ボンド　エフレックスタイルワン　ライトグレー",2,null,"kg",null,null,"本",0,null,"kg","kg"]
["ｆ１",44,1156892010,"ボンド　エフレックスＦ１",10,null,"kg",null,null,"缶",0,null,"kg","kg"]
["ｆ１きしゃく",45,1156965104,"ボンド　Ｆ１希釈剤",4,null,"L",null,null,"缶",0,null,"L","L"]
["なかぬりしゅ*",46,1371714200,"ボンド　シリンダーセットミニ",null,null,null,null,null,null,0,null,"個","個"]
["なかぬりしゅ",47,null,null,null,null,null,null,null,null,0,null,{"$f":"IF(D50=\"\",\"\",G50)","v":""},{"$f":"IF(D50=\"\",\"\",G50)","v":""}]
["なかぬりこうか",48,null,null,null,null,null,null,null,null,0,null,"",""]
[null,49,1154119020,"ボンド　カーボピンネット中塗り１材",20,null,"kg",null,null,"袋",0,null,"kg","kg"]
["ｖｍ",50,1371697001,"ボンド　ＶＭネット",100,null,"m",null,null,"巻",0,null,"m","m"]
["ｍｓ",51,1161386104,"ボンド　ＭＳシール",4,null,"Lset",null,null,"set",0,null,"Lset","Lset"]
["ｐｓ",52,1161516104,"ボンド　ＰＳシール",4,null,"Lset",null,null,"set",0,null,"Lset","Lset"]
["びゅ",53,1161597106,"ボンド　ビューシール６９０９",6,null,"Lset",null,null,"set",0,null,"Lset","Lset"]
["しるぷら９",54,1161918250,"ボンド　シールプライマー＃９",500,null,"g",null,null,"缶",0,null,"g","g"]
["しるぷら７",55,1161916250,"ボンド　シールプライマー＃７",500,null,"g",null,null,"缶",0,null,"g","g"]
[null,56,1161919250,"ボンド　シールプライマー＃３８",500,null,"g",null,null,"缶",{"$f":"E59*H59","v":0},null,{"$f":"IF(D59=\"\",\"\",G59)","v":"g"},{"$f":"IF(D59=\"\",\"\",G59)","v":"g"}]
["しるからぐれ*",57,"1161950002*","ボンド　シールカラーマスター　",160,null,"g",null,null,"個",0,null,"g","g"]
["しるからぐれ",58,1161950002,"ボンド　シールカラーマスター　グレー",160,null,"g",null,null,"個",0,null,"g","g"]
["しるからこん",59,1161950012,"ボンド　シールカラーマスター　コンクリートグレー",160,null,"g",null,null,"個",0,null,"g","g"]
["しるからすて",60,1161950009,"ボンド　シールカラーマスター　ステンカラー",160,null,"g",null,null,"個",0,null,"g","g"]
["しるだくぐれ",61,1161950004,"ボンド　シールカラーマスター　ダークグレー",160,null,"g",null,null,"個",0,null,"g","g"]
["しるからにゆあい",62,1161950003,"ボンド　シールカラーマスター　ニューアイボリー",160,null,"g",null,null,"個",0,null,"g","g"]
["しるからにゆあん",63,1161950011,"ボンド　シールカラーマスター　ニューアンバー",160,null,"g",null,null,"個",0,null,"g","g"]
["しるからにゆぶろ",64,1161950010,"ボンド　シールカラーマスター　ニューブロンズ",160,null,"g",null,null,"個",0,null,"g","g"]
["しるからぶら",65,1161950005,"ボンド　シールカラーマスター　ブラック",160,null,"g",null,null,"個",0,null,"g","g"]
["しるからほわ",66,1161950007,"ボンド　シールカラーマスター　ホワイト",160,null,"g",null,null,"個",0,null,"g","g"]
["しるかららいとぐ",67,1161950008,"ボンド　シールカラーマスター　ライトグレー",160,null,"g",null,null,"個",0,null,"g","g"]
[null,68,1161950013,"ボンド　シールカラーマスター　ニューホワイト",160,null,"g",null,null,"個",{"$f":"E71*H71","v":0},null,{"$f":"IF(D71=\"\",\"\",G71)","v":"g"},{"$f":"IF(D71=\"\",\"\",G71)","v":"g"}]
["あう",69,1161820104,"ボンド　ＡＵシール",4,null,"Lset",null,null,"set",0,null,"Lset","Lset"]
["あうぐれ*",70,"1162190333*","ボンド　ＡＵクイック　",333,null,"ml",null,null,"本",0,null,"ml","ml"]
["あうぐれ",71,1162190333,"ボンド　ＡＵクイック　グレー",333,null,"ml",null,null,"本",0,null,"ml","ml"]
["あうほわ",72,1162191333,"ボンド　ＡＵクイック　ホワイト",333,null,"ml",null,null,"本",0,null,"ml","ml"]
["ｍｓぐれ*",73,"1164971000*","ボンド　ＭＳコーク　ノンブリードＬＭ",320,null,"ml",null,null,"本",0,null,"ml","ml"]
["ｍｓぐれ",74,1164974332,"ボンド　ＭＳコーク　ノンブリードＬＭ　グレー",320,null,"ml",null,null,"本",0,null,"ml","ml"]
["ｍｓこんぐれ",75,1164973332,"ボンド　ＭＳコーク　ノンブリードＬＭ　コンクリートグレー",320,null,"ml",null,null,"本",0,null,"ml","ml"]
["ｍっすてん",76,1164977332,"ボンド　ＭＳコーク　ノンブリードＬＭ　ステンカラー",320,null,"ml",null,null,"本",0,null,"ml","ml"]
["ｍｓだくぐれ",77,1164975332,"ボンド　ＭＳコーク　ノンブリードＬＭ　ダークグレー",320,null,"ml",null,null,"本",0,null,"ml","ml"]
["ｍｓにゅあい",78,1164976332,"ボンド　ＭＳコーク　ノンブリードＬＭ　ニューアイボリー",320,null,"ml",null,null,"本",0,null,"ml","ml"]
["ｍｓにゅあん",79,1164978332,"ボンド　ＭＳコーク　ノンブリードＬＭ　ニューアンバー",320,null,"ml",null,null,"本",0,null,"ml","ml"]
["ｍｓにゅぶろ",80,1164979332,"ボンド　ＭＳコーク　ノンブリードＬＭ　ニューブロンズ",320,null,"ml",null,null,"本",0,null,"ml","ml"]
["ｍｓぶら",81,1164980332,"ボンド　ＭＳコーク　ノンブリードＬＭ　ブラック",320,null,"ml",null,null,"本",0,null,"ml","ml"]
["ｍしょわ",82,1161920250,"ボンド　シールプライマー＃１１",500,null,"g",null,null,"缶",0,null,"g","g"]
["ｍｓらいとぐ",83,1164972332,"ボンド　ＭＳコーク　ノンブリードＬＭ　ライトグレー",320,null,"ml",null,null,"本",0,null,"ml","ml"]
[null,84,1164971332,"ボンド　ＭＳコーク　ノンブリードＬＭ　ニューホワイト",320,null,"ml",null,null,"本",{"$f":"E87*H87","v":0},null,{"$f":"IF(D87=\"\",\"\",G87)","v":"ml"},{"$f":"IF(D87=\"\",\"\",G87)","v":"ml"}]
["うれぐれ*",85,"1162505332*","ボンド　ウレタンコーク",320,null,"ml",null,null,"本",0,null,"ml","ml"]
["うれあい",86,1162503332,"ボンド　ウレタンコーク　アイボリー",320,null,"ml",null,null,"本",0,null,"ml","ml"]
["うれあん",87,1162504332,"ボンド　ウレタンコーク　アンバー",320,null,"ml",null,null,"本",0,null,"ml","ml"]
["うれぐれ",88,1162505332,"ボンド　ウレタンコーク　グレー",320,null,"ml",null,null,"本",0,null,"ml","ml"]
["うれぶら",89,1162507332,"ボンド　ウレタンコーク　ブラック",320,null,"ml",null,null,"本",0,null,"ml","ml"]
["うれほわ",90,1162506332,"ボンド　ウレタンコーク　ホワイト",320,null,"ml",null,null,"本",0,null,"ml","ml"]
["うれらいとぐ",91,1162513332,"ボンド　ウレタンコーク　ライトグレー",320,null,"ml",null,null,"本",0,null,"ml","ml"]
["しりぐれ*",92,"1162602333*","ボンド　シリコンコーク　",330,null,"ml",null,null,"本",0,null,"ml","ml"]
["しりあい",93,1162600333,"ボンド　シリコンコーク　アイボリー",330,null,"ml",null,null,"本",0,null,"ml","ml"]
["しりある",94,1162601333,"ボンド　シリコンコーク　アルミ",330,null,"ml",null,null,"本",0,null,"ml","ml"]
["しりあん",95,1162610333,"ボンド　シリコンコーク　アンバー",330,null,"ml",null,null,"本",0,null,"ml","ml"]
["しりくり",96,1162603333,"ボンド　シリコンコーク　クリヤー",330,null,"ml",null,null,"本",0,null,"ml","ml"]
["しりぐれ",97,1162602333,"ボンド　シリコンコーク　グレー",330,null,"ml",null,null,"本",0,null,"ml","ml"]
["しりすて",98,1162564333,"ボンド　シリコンコーク　ステンカラー",330,null,"ml",null,null,"本",0,null,"ml","ml"]
["しりだくあい",99,1162611333,"ボンド　シリコンコーク　ダークアイボリー",330,null,"ml",null,null,"本",{"$f":"E102*H102","v":0},null,{"$f":"IF(D102=\"\",\"\",G102)","v":"ml"},{"$f":"IF(D102=\"\",\"\",G102)","v":"ml"}]
["しりだくある",100,1162565333,"ボンド　シリコンコーク　ダークアルミ",330,null,"ml",null,null,"本",0,null,"ml","ml"]
["しりだくぶら",101,1162604333,"ボンド　シリコンコーク　ダークブラウン",330,null,"ml",null,null,"本",0,null,"ml","ml"]
["しりにゆぶる",102,1162614333,"ボンド　シリコンコーク　ニューブルー",330,null,"ml",null,null,"本",0,null,"ml","ml"]
["しりぶら",103,1162606333,"ボンド　シリコンコーク　ブラック",330,null,"ml",null,null,"本",0,null,"ml","ml"]
["しりほわ",104,1162607333,"ボンド　シリコンコーク　ホワイト",330,null,"ml",null,null,"本",0,null,"ml","ml"]
["しりらいとぐ",105,1162612333,"ボンド　シリコンコーク　ライトグレー",330,null,"ml",null,null,"本",0,null,"ml","ml"]
[null,106,1161397104,"ボンド　ＭＳシール超耐久",4,null,"Lset",null,null,"set",0,null,"Lset","Lset"]
["びるど",107,1161625104,"ボンド　ビルドシールＳＲ",4,null,"Lset",null,null,"set",0,null,"Lset","Lset"]
["びるどぐれ*",108,"1161633327*","ボンド　ビルドシールＳＲ用カラーマスター　",0.27,null,"L",null,null,"個",0,null,"L","L"]
["びるどらいとぐ",109,1161632327,"ボンド　ビルドシールＳＲ用カラーマスター　　ライトグレー",0.27,null,"L",null,null,"個",0,null,"L","L"]
["びるどぐれ",110,1161633327,"ボンド　ビルドシールＳＲ用カラーマスター　グレー",0.27,null,"L",null,null,"個",0,null,"L","L"]
["びるどこんぐれ",111,1161631327,"ボンド　ビルドシールＳＲ用カラーマスター　コンクリートグレー",0.27,null,"L",null,null,"個",0,null,"L","L"]
["びるどすて",112,1161635327,"ボンド　ビルドシールＳＲ用カラーマスター　ステンカラー",0.27,null,"L",null,null,"個",0,null,"L","L"]
["びるどだくぐれ",113,1161634327,"ボンド　ビルドシールＳＲ用カラーマスター　ダークグレー",0.27,null,"L",null,null,"個",0,null,"L","L"]
["びるどにゆあい",114,1161630327,"ボンド　ビルドシールＳＲ用カラーマスター　ニューアイボリー",0.27,null,"L",null,null,"個",0,null,"L","L"]
["びるどにゆあん",115,1161636327,"ボンド　ビルドシールＳＲ用カラーマスター　ニューアンバー",0.27,null,"L",null,null,"個",0,null,"L","L"]
["びるどにゆぶろ",116,1161637327,"ボンド　ビルドシールＳＲ用カラーマスター　ニューブロンズ",0.27,null,"L",null,null,"個",0,null,"L","L"]
["びるどぶら",117,1161638327,"ボンド　ビルドシールＳＲ用カラーマスター　ブラック",0.27,null,"L",null,null,"個",0,null,"L","L"]
["びるどほわ",118,1161629327,"ボンド　ビルドシールＳＲ用カラーマスター　ホワイト　",0.27,null,"L",null,null,"個",0,null,"L","L"]
["びるどちえん",119,1161628020,"ボンド　ビルドシールＳＲ硬化遅延剤",200,null,"g",null,null,"個",0,null,"g","g"]
["しりこんｃ",120,1161626330,"ボンド　シールプライマーシリコン用C",300,null,"ml",null,null,"缶",0,null,"ml","ml"]
["しりこんｆ",121,1161627330,"ボンド　シールプライマーシリコン用Ｆ",300,null,"ml",null,null,"缶",0,null,"ml","ml"]
["えふぐれ*",122,"1159731333*","ボンド　エフレックス",333,null,"ml",null,null,"本",0,null,"ml","ml"]
["えふぐれ",123,1159731333,"ボンド　エフレックス　グレー",333,null,"ml",null,null,"本",0,null,"ml","ml"]
["えふほわ",124,1159730333,"ボンド　エフレックス　ホワイト",333,null,"ml",null,null,"本",0,null,"ml","ml"]
["ｓｒんｂ５０３３３",125,"1366201003*","ＳＲシールＮＢ５０　",333,null,"ml",null,null,"本",0,null,"ml","ml"]
["ｓｒんｂ５０６",126,"1366203003*","ＳＲシールＮＢ５０　",6,null,"L",null,null,"缶",0,null,"L","L"]
["ｓｒｓ７０３３３",127,"1177500364*","ＳＲシールＳ７０　",333,null,"ml",null,null,"本",0,null,"ml","ml"]
["ｓｒｓ７０６",128,"1177700364*","ＳＲシールＳ７０　",6,null,"L",null,null,"缶",0,null,"L","L"]
[null,129,null,null,null,null,null,null,null,null,0,null,"",""]
[null,130,1371618001,"カートリッジディスペンサーＨ２９３ＪＰ",400,null,"ml用",null,null,"台",0,null,"ml用","ml用"]
["とりねお",131,1371952201,"トリネオＴＳＳ１８１０Ｙ",100,null,"m",null,null,"巻",0,null,"m","m"]
[null,132,1371670033,"トレカクロスＵＴ７０－２０Ｇ－３３",50,null,"m",null,null,"巻",0,null,"m","m"]
[null,133,1371670050,"トレカクロスＵＴ７０－２０Ｇ－５０",50,null,"m",null,null,"巻",0,null,"m","m"]
[null,134,1371662000,"トレカラミネートＴＬ５２０",50,null,"m",null,null,"巻",0,null,"m","m"]
["　",135,1157247007,"ボンド　ＡＭプライマーＳ",7,null,"kgset",null,null,"set",null,null,"kgset","kgset"]
["ぼーど２０",136,1157244007,"ボンド　ＡＭプライマーＷ",7,null,"kgset",null,null,"set",{"$f":"E139*H139","v":0},null,{"$f":"IF(D139=\"\",\"\",G139)","v":"kgset"},{"$f":"IF(D139=\"\",\"\",G139)","v":"kgset"}]
["あｍぷらいまｓ",137,null,null,null,null,null,null,null,null,0,null,"",""]
["あｍぷらいまｓ",138,null,null,null,null,null,null,null,null,0,null,"",""]
[null,139,null,null,null,null,null,null,null,null,0,null,"",""]
[null,140,null,null,null,null,null,null,null,null,0,null,"",""]
["あうほわ*",141,"1162191333*","ボンド　ＡＵクイック　",333,null,"ml",null,null,"本",0,null,"ml","ml"]
[null,142,1158290016,"ボンド　ＡコートＦ　Ｎ－７５",16,null,"kgset",null,null,"set",0,null,"kgset","kgset"]
["ｂｃざがね",143,1371708000,"ボンド　ＢＣ座金",null,null,null,null,null,"個",0,null,"個","個"]
["ｃｈ００５ん２０",144,1371670025,"トレカクロスＵＴ７０－２０－２５",50,null,"m",null,null,"巻",0,null,"m","m"]
["ｃｈ００８ん２０",145,1372601100,"トレカクロスＢＴ７０－２０－１００",50,null,"m",null,null,"巻",0,null,"m","m"]
["ｃｈ１０００なつがた",146,1371671025,"トレカクロスＵＴ７０－３０－２５",50,null,"m",null,null,"巻",0,null,"m","m"]
["ｃｈ１０００ふゆがた",147,1372620050,"トレカクロスＵＴ７０－４０－５０",50,null,"m",null,null,"巻",0,null,"m","m"]
["ｃｈ１８７５０",148,1372621050,"トレカクロスＵＴ７０－４５－５０",50,null,"m",null,null,"巻",0,null,"m","m"]
["ｃｈ１８１８",149,1372622050,"トレカクロスＵＴ７０－６０－５０",50,null,"m",null,null,"巻",0,null,{"$f":"IF(D150=\"\",\"\",G150)","v":"m"},"m"]
["ｃｈ１８２０",150,1371669025,"トレカクロスＵＭ４６－３０－２５",50,null,"m",null,null,"巻",{"$f":"E151*H153","v":0},null,"m","m"]
["ｃｈ３８",151,1372602025,"トレカクロスＵＭ４６－３４－２５",50,null,"m",null,null,"巻",{"$f":"E152*H154","v":0},null,"m","m"]
["ｃｈ３８ｔ",152,1372600025,"トレカクロスＵＭ４６－４０Ｇ－２５",50,null,"m",null,null,"巻",{"$f":"E153*H155","v":0},null,"m","m"]
["ｃｋ１１３",153,null,null,null,null,null,null,null,null,{"$f":"E154*H156","v":0},null,{"$f":"IF(D156=\"\",\"\",G156)","v":""},{"$f":"IF(D156=\"\",\"\",G156)","v":""}]
["ｃｋ４１ｆ",154,null,null,null,null,null,null,null,null,{"$f":"E155*H157","v":0},null,"",""]
["ｃｋ５５",155,null,null,null,null,null,null,null,null,{"$f":"E158*H158","v":0},null,"",""]
["うちこみ６５０",156,1371642000,"ボンド　ＣＰアンカーＮｏ．６５０打ち込み棒",null,null,null,null,null,"個",{"$f":"IF(A148=\"\",\"\",E159*H159)","v":0},null,"個","個"]
["うちこみ６７０",157,1371642001,"ボンド　ＣＰアンカーＮｏ．６７０打ち込み棒",null,null,null,null,null,"個",{"$f":"IF(A149=\"\",\"\",E160*H160)","v":0},null,"個","個"]
["あｌ６７０",158,1371633001,"ボンド　ＣＰアンカーピンＡＬ６７０",null,null,null,null,null,"本",{"$f":"IF(A150=\"\",\"\",E161*H161)","v":0},null,"本","本"]
["え５５０",159,1371637025,"ボンド　ＣＰアンカーピンＥ５５０",null,null,null,null,null,"本",0,null,"本","本"]
["え５７０",160,1371637026,"ボンド　ＣＰアンカーピンＥ５７０",null,null,null,null,null,"本",0,null,"本","本"]
["え６１０",161,1371637002,"ボンド　ＣＰアンカーピンＥ６１０",null,null,null,null,null,"本",0,null,"本","本"]
["え６５０",162,1371637008,"ボンド　ＣＰアンカーピンＥ６５０",null,null,null,null,null,"本",0,null,"本","本"]
["え６７０",163,1371637007,"ボンド　ＣＰアンカーピンＥ６７０",null,null,null,null,null,"本",0,null,"本","本"]
["ｎ５３０",164,1371634003,"ボンド　ＣＰアンカーピンＮ５３０",null,null,null,null,null,"本",0,null,"本","本"]
["ｎ５５０",165,1371637019,"ボンド　ＣＰアンカーピンＮ５５０",null,null,null,null,null,"本",0,null,"本","本"]
["ｎ５７０",166,1371637022,"ボンド　ＣＰアンカーピンＮ５７０",null,null,null,null,null,"本",0,null,"本","本"]
["ｎ６１０",167,1371637012,"ボンド　ＣＰアンカーピンＮ６１０",null,null,null,null,null,"本",0,null,"本","本"]
["ｎ６５０",168,1371637005,"ボンド　ＣＰアンカーピンＮ６５０",null,null,null,null,null,"本",0,null,"本","本"]
["ｎ６７０",169,1371637003,"ボンド　ＣＰアンカーピンＮ６７０",null,null,null,null,null,"本",0,null,"本","本"]
["ｃｐ６．５",170,1372820001,"ボンド　ＣＰキャップ６．５",null,null,null,null,null,"個",{"$f":"IF(A161=\"\",\"\",E173*H173)","v":0},null,"個","個"]
["ｃｐ９．０",171,1372820002,"ボンド　ＣＰキャップ９．０",null,null,null,null,null,"個",{"$f":"IF(A162=\"\",\"\",E174*H174)","v":0},null,"個","個"]
["ｃｘ５０",172,1371637024,"ボンド　ＣＰアンカーピンＥ５３５",null,null,null,null,null,"本",{"$f":"IF(A163=\"\",\"\",E175*H175)","v":0},null,"本","本"]
["え１２００ｓ*",173,"1157003006*","ボンド　Ｅ１２００",6,null,"kgset",null,null,"set",{"$f":"E176*H176","v":0},null,{"$f":"IF(D176=\"\",\"\",G176)","v":"kgset"},{"$f":"IF(D176=\"\",\"\",G176)","v":"kgset"}]
["え１２００ｗ*",174,"1157012006*","ボンド　Ｅ１２００",6,null,"kgset",null,null,"set",0,null,"kgset","kgset"]
["え１２００ｓ",175,1157003006,"ボンド　Ｅ１２００Ｓ",6,null,"kgset",null,null,"set",0,null,"kgset","kgset"]
["え１２００ｗ",176,1157012006,"ボンド　Ｅ１２００Ｗ",6,null,"kgset",null,null,"set",0,null,"kgset","kgset"]
["え２００１",177,1156003001,"ボンド　Ｅ２００",1,null,"kgset",null,null,"set",0,null,"kgset","kgset"]
["え２００５",178,1156003005,"ボンド　Ｅ２００",5,null,"kgset",null,null,"set",0,null,"kgset","kgset"]
["え２００２０",179,1156003020,"ボンド　Ｅ２００",20,null,"kgset",null,null,"set",0,null,"kgset","kgset"]
["え２０００ｓ*",180,"1157046290*","ボンド　Ｅ２０００",900,null,"gset",null,null,"set",0,null,"gset","gset"]
["え２０００ｓ",181,1157046290,"ボンド　Ｅ２０００Ｓ",900,null,"gset",null,null,"set",0,null,"gset","gset"]
["え２０００ｗ",182,1157055290,"ボンド　Ｅ２０００Ｗ",900,null,"gset",null,null,"set",0,null,"gset","gset"]
[null,183,1157083012,"ボンド　Ｅ２０００ＳＳ",900,null,"gset",null,null,"set",{"$f":"E186*H186","v":0},null,{"$f":"IF(D186=\"\",\"\",G186)","v":"gset"},{"$f":"IF(D186=\"\",\"\",G186)","v":"gset"}]
[null,184,"1157046012*","ボンド　Ｅ２０００",12,null,"kgset",null,null,"set",{"$f":"E187*H187","v":0},null,{"$f":"IF(D187=\"\",\"\",G187)","v":"kgset"},{"$f":"IF(D187=\"\",\"\",G187)","v":"kgset"}]
[null,185,1157046012,"ボンド　Ｅ２０００Ｓ",12,null,"kgset",null,null,"set",{"$f":"E188*H188","v":0},null,{"$f":"IF(D188=\"\",\"\",G188)","v":"kgset"},{"$f":"IF(D188=\"\",\"\",G188)","v":"kgset"}]
[null,186,1157055012,"ボンド　Ｅ２０００Ｗ",12,null,"kgset",null,null,"set",{"$f":"E189*H189","v":0},null,{"$f":"IF(D189=\"\",\"\",G189)","v":"kgset"},{"$f":"IF(D189=\"\",\"\",G189)","v":"kgset"}]
[null,187,1157083012,"ボンド　Ｅ２０００ＳＳ",12,null,"kgset",null,null,"set",{"$f":"E190*H190","v":0},null,{"$f":"IF(D190=\"\",\"\",G190)","v":"kgset"},{"$f":"IF(D190=\"\",\"\",G190)","v":"kgset"}]
["え２０６ｗ*",188,1371803012,"エフモル０５",12.5,null,"kg",null,null,"袋",{"$f":"E191*H191","v":0},null,{"$f":"IF(D191=\"\",\"\",G191)","v":"kg"},{"$f":"IF(D191=\"\",\"\",G191)","v":"kg"}]
["え２０７ｄｗ*",189,1371803020,"エフモル０５",20,null,"kg",null,null,"袋",0,null,"kg","kg"]
["え２０８ｗ*",190,1371789020,"エフモルＡＩ",20,null,"kg",null,null,"袋",0,null,"kg","kg"]
["え２０９ｗ３*",191,1371839020,"ボンド　エフモルＫＨ",20,null,"kg",null,null,"袋",0,null,"kg","kg"]
["え２０９ｗ６*",192,1111082018,"ボンド　ＣＡＴ１８",18,null,"kg",null,null,"缶",0,null,"kg","kg"]
["え２３００ｗ*",193,null,null,null,null,null,null,null,null,0,null,"",""]
["え２３００ｊｗ*",194,null,null,null,null,null,null,null,null,0,null,"",""]
["え２３０ｇ４００",195,1158114340,"ボンド　Ｅ２３０Ｇ",400,null,"ml",null,null,"本",0,null,"ml","ml"]
["え２３０ｇ９００",196,1158114390,"ボンド　Ｅ２３０Ｇ",900,null,"ml",null,null,"本",0,null,"ml","ml"]
["え２３７０ｍｗ*",197,null,null,null,null,null,null,null,null,0,null,"",""]
["え２４１０",198,1157132015,"ボンド　Ｅ２４１０",15,null,"kgset",null,null,"set",0,null,"kgset","kgset"]
["え２５０８００",199,null,null,null,null,null,null,null,null,0,null,"",""]
["え２５００ｓ*",200,"1154053015*","ボンド　Ｅ２５００",15,null,"kgset",null,null,"set",0,null,"kgset","kgset"]
["え２５００ｗ*",201,null,null,null,null,null,null,null,null,0,null,"",""]
["え２５００ｓ",202,1154053015,"ボンド　Ｅ２５００Ｓ",15,null,"kgset",null,null,"set",0,null,"kgset","kgset"]
["え２５００ｗ",203,1154056015,"ボンド　Ｅ２５００Ｗ",15,null,"kgset",null,null,"set",0,null,"kgset","kgset"]
[null,204,null,null,null,null,null,null,null,null,0,null,"",""]
["え２６０１ｓ*",205,"1156070003*","ボンド　Ｅ２６０１",3,null,"kgset",null,null,"set",0,null,"kgset","kgset"]
["え２６０１ｗ*",206,null,null,null,null,null,null,null,null,0,null,"",""]
["え２６０１ｓ",207,1156070003,"ボンド　Ｅ２６０１Ｓ",3,null,"kgset",null,null,"set",0,null,"kgset","kgset"]
["え２６０１ｗ",208,1156073003,"ボンド　Ｅ２６０１Ｗ",3,null,"kgset",null,null,"set",0,null,"kgset","kgset"]
["え２７５ｓ*",209,"1158123003*","ボンド　Ｅ２７５",3,null,"kgset",null,null,"set",0,null,"kgset","kgset"]
["え２７５ｗ*",210,null,null,null,null,null,null,null,null,0,null,"",""]
["え２７５ｓ",211,1158123003,"ボンド　Ｅ２７５Ｓ",3,null,"kgset",null,null,"set",0,null,"kgset","kgset"]
["え２７５ｗ",212,1158126003,"ボンド　Ｅ２７５Ｗ",3,null,"kgset",null,null,"set",0,null,"kgset","kgset"]
["え２８０ｇ４００",213,null,null,null,null,null,null,null,null,0,null,"",""]
["え２９００ｊｓ*",214,"1157583015*","ボンド　Ｅ２９００Ｊ",15,null,"kgset",null,null,"set",0,null,"kgset","kgset"]
["え２９００ｊｗ*",215,null,null,null,null,null,null,null,null,0,null,"",""]
["え２９００ｊｓ",216,1157583015,"ボンド　Ｅ２９００ＪＳ",15,null,"kgset",null,null,"set",0,null,"kgset","kgset"]
["え２９００ｊｗ",217,1157584015,"ボンド　Ｅ２９００ＪＷ",15,null,"kgset",null,null,"set",0,null,"kgset","kgset"]
[null,218,"1157583006*","ボンド　Ｅ２９００Ｊ",6,null,"kgset",null,null,"set",{"$f":"E221*H221","v":0},null,{"$f":"IF(D221=\"\",\"\",G221)","v":"kgset"},{"$f":"IF(D221=\"\",\"\",G221)","v":"kgset"}]
[null,219,1157583006,"ボンド　Ｅ２９００ＪＳ",6,null,"kgset",null,null,"set",{"$f":"E222*H222","v":0},null,{"$f":"IF(D222=\"\",\"\",G222)","v":"kgset"},{"$f":"IF(D222=\"\",\"\",G222)","v":"kgset"}]
[null,220,1157584006,"ボンド　Ｅ２９００ＪＷ",6,null,"kgset",null,null,"set",{"$f":"E223*H223","v":0},null,{"$f":"IF(D223=\"\",\"\",G223)","v":"kgset"},{"$f":"IF(D223=\"\",\"\",G223)","v":"kgset"}]
["え３５０ｒ２０",221,1156644008,"ボンド　Ｅ３８０Ｆ",8,null,"kgset",null,null,"set",0,null,"kgset","kgset"]
["え３８０９００",222,1156135290,"ボンド　Ｅ３８０",900,null,"gset",null,null,"set",0,null,"gset","gset"]
["え３８０６",223,1156135006,"ボンド　Ｅ３８０",6,null,"kgset",null,null,"set",0,null,"kgset","kgset"]
["え３８０１０",224,1156135010,"ボンド　Ｅ３８０",10,null,"kgset",null,null,"set",0,null,"kgset","kgset"]
["え３９０６",225,1156662006,"ボンド　Ｅ３９０",6,null,"kgset",null,null,"set",0,null,"kgset","kgset"]
["え３９０６ｔｌ",226,"1156662006ｔｌ","ボンド　Ｅ３９０ＴＬ",6,null,"kgset",null,null,"set",0,null,"kgset","kgset"]
["え３９５ｓ*",227,"1156602015*","ボンド　Ｅ３９５",15,null,"kgset",null,null,"set",0,null,"kgset","kgset"]
["え３９５ｗ*",228,null,null,null,null,null,null,null,null,0,null,"",""]
["え３９５ｓ",229,1156602015,"ボンド　Ｅ３９５Ｓ",15,null,"kgset",null,null,"set",0,null,"kgset","kgset"]
["え３９５ｗ",230,1156626015,"ボンド　Ｅ３９５Ｗ",15,null,"kgset",null,null,"set",0,null,"kgset","kgset"]
["え４０００んｓらいとぐ*",231,"1158208015*","ボンド　Ｅ４０００ＮＳ",15,null,"kgset",null,null,"set",0,null,"kgset","kgset"]
["え４０００んｓらいとぶ*",232,null,null,null,null,null,null,null,null,0,null,"",""]
["え４０００んｓらいとぐ",233,1158208015,"ボンド　Ｅ４０００ＮＳ　ライトグレー",15,null,"kgset",null,null,"set",0,null,"kgset","kgset"]
["え４０００んｓらいとぶ",234,null,null,null,null,null,null,null,null,0,null,"",""]
["え４０００んｗらいとぐ*",235,"1158213015*","ボンド　Ｅ４０００ＮＷ",15,null,"kgset",null,null,"set",0,null,"kgset","kgset"]
["え４０００んｗらいとぶ*",236,null,null,null,null,null,null,null,null,{"$f":"E239*H239","v":0},null,"",""]
["え４０００んｗらいとぐ",237,1158213015,"ボンド　Ｅ４０００ＮＷ　ライトグレー",15,null,"kgset",null,null,"set",0,null,{"$f":"IF(D240=\"\",\"\",G240)","v":"kgset"},{"$f":"IF(D240=\"\",\"\",G240)","v":"kgset"}]
["え４０００んｗらいとぶ",238,null,null,null,null,null,null,null,null,0,null,"",""]
["え４８８",239,1158256020,"ボンド　Ｅ４８８",20,null,"kgset",null,null,"set",0,null,"kgset","kgset"]
["え８１０ｌｓ*",240,"1156689007*","ボンド　Ｅ８１０Ｌ",7,null,"kgset",null,null,"set",0,null,"kgset","kgset"]
["え８１０ｌｗ*",241,null,null,null,null,null,null,null,null,0,null,"",""]
["え８１０ｌｓ",242,1156689007,"ボンド　Ｅ８１０ＬＳ",7,null,"kgset",null,null,"set",0,null,"kgset","kgset"]
["え８１０ｌｗ",243,1156699007,"ボンド　Ｅ８１０ＬＷ",7,null,"kgset",null,null,"set",0,null,"kgset","kgset"]
["えｋ２７０ｗ",244,null,null,null,null,null,null,null,null,0,null,"",""]
["えｍｓ２０",245,1158129006,"ボンド　Ｅ２５８ＲＳ",6,null,"kgset",null,null,"set",0,null,"kgset","kgset"]
["えｐｘ２",246,1158132006,"ボンド　Ｅ２５８ＲＷ",6,null,"kgset",null,null,"set",0,null,"kgset","kgset"]
["えｐｘ２ｗ",247,null,null,null,null,null,null,null,null,0,null,"",""]
["えｐｘ３",248,null,null,null,null,null,null,null,null,0,null,"",""]
["えｐｘ３ｗ",249,null,null,null,null,null,null,null,null,0,null,"",""]
["えうすめ",250,1158087116,"ボンド　Ｅうすめ液",16,null,"L",null,null,"缶",0,null,"L","L"]
["えぷらいまー",251,1157411008,"ボンド　Ｅプライマー",8,null,"kgset",null,null,"set",0,null,"kgset","kgset"]
["えもるたる",252,1157556009,"ボンド　Eモルタル",9,null,"kgset",null,null,"set",0,null,"kgset","kgset"]
["ｆｒ",253,1161522104,"ボンド　ＦＲシール",4,null,"Ｌset",null,null,"set",0,null,"Ｌset","Ｌset"]
["ｆことｆ*",254,"1158005418*","ボンド　ＦコートＦ",18,null,"kgset",null,null,"set",0,null,"kgset","kgset"]
["ｆことｆ",255,1158005418,"ボンド　ＦコートＦ　Ｎ－７５",18,null,"kgset",null,null,"set",0,null,"kgset","kgset"]
["ｆこーとふすめ",256,1157802116,"ボンド　ＦコートＦ　うすめ液",16,null,"Ｌ",null,null,"缶",0,null,"Ｌ","Ｌ"]
["ｇ１０３１７０",257,"1371341018*","ボンド　ＵコートＦ",18,null,"kgset",null,null,"set",0,null,"kgset","kgset"]
["ｇ１０３１",258,1371341018,"ボンド　ＵコートＦ　Ｎ－７５",18,null,"kgset",null,null,"set",0,null,"kgset","kgset"]
["ｇ１０３３",259,1371357116,"ボンド　Ｕコートうすめ液",16,null,"Ｌ",null,null,"缶",0,null,"Ｌ","Ｌ"]
["ｇ１０３１５",260,1158083016,"ボンド　ＡコートＦ",16.5,null,"kgset",null,null,"set",0,null,"kgset","kgset"]
["ｇ１０ｚ３",261,null,null,null,null,null,null,null,null,{"$f":"E507*H507","v":0},null,"",""]
["ｇ１１ｚ１５",262,null,null,null,null,null,null,null,null,{"$f":"E508*H508","v":0},null,"",""]
["ｇ１７１７０",263,null,null,null,null,null,null,null,null,0,null,"",""]
["ｇ１７ｚ３",264,null,null,null,null,null,null,null,null,0,null,"",""]
["ｇ１７すぷれ",265,1371667910,"フィブラシートＡＫ－９０－１０ＣＭ",50,null,"m",null,null,"巻",0,null,"m","m"]
["ｇ２００２３",266,1371667930,"フィブラシートＡＫ－９０－３０ＣＭ",50,null,"m",null,null,"巻",0,null,"m","m"]
["ｇ７７００ん",267,1371667950,"フィブラシートＡＫ－９０－５０ＣＭ",50,null,"m",null,null,"巻",0,null,"m","m"]
["ｇ７７ｚ",268,1371667610,"フィブラシートＡＫ－６０－１０ＣＭ",50,null,"m",null,null,"巻",0,null,"m","m"]
["ｇ７８ｚ３",269,1371667650,"フィブラシートＡＫ－６０－５０ＣＭ",50,null,"m",null,null,"巻",0,null,"m","m"]
["ｇ９０００",270,1371666055,"フィブラメッシュＡＫＭ－５・５－１Ｍ",50,null,"m",null,null,"巻",0,null,"m","m"]
["ｇｓ７０７",271,1371666110,"フィブラメッシュＡＫＭ－１０・１０－１Ｍ",50,null,"m",null,null,"巻",0,null,"m","m"]
["ｇくりや１７０",272,1371667110,"フィブラシートＡＫ－１０・１０－１Ｍ",50,null,"m",null,null,"巻",0,null,"m","m"]
["ｋ１０あ３",273,1371629001,"フィブラシートＦＸ－ＡＴ－４０－５０ＣＭ",50,null,"m",null,null,"巻",0,null,"m","m"]
["ｋ１１０３",274,1371629002,"フィブラシートＦＸ－ＡＴ－６０－５０ＣＭ",50,null,"m",null,null,"巻",0,null,"m","m"]
["ｋ１２０１７０",275,1371629003,"フィブラシートＦＸ－ＡＴ－９０－５０ＣＭ",50,null,"m",null,null,"巻",0,null,"m","m"]
["ｋ１２０３",276,1371629004,"フィブラシートＦＸ－ＡＴ－１２０－５０ＣＭ",50,null,"m",null,null,"巻",0,null,"m","m"]
["ｋｍｐ１０ｓ３*",277,1371667210,"フィブラシートＡＫ－１２０－１０ＣＭ",50,null,"m",null,null,"巻",0,null,"m","m"]
["ｋｍｐ１０ｗ３*",278,1371667251,"フィブラシートＡＫ－１２０－５０ＣＭ",50,null,"m",null,null,"巻",0,null,"m","m"]
["ｋｍｐ１０ｓ１４*",279,1371667410,"フィブラシートＡＫ－４０－１０ＣＭ",50,null,"m",null,null,"巻",0,null,"m","m"]
["ｋｍｐ１０ｗ１４*",280,1371667430,"フィブラシートＡＫ－４０－３０ＣＭ",50,null,"m",null,null,"巻",0,null,"m","m"]
["ｋｍｐ１０ｓ３",281,1371667440,"フィブラシートＡＫ－４０・４０－１Ｍ",25,null,"m",null,null,"巻",0,null,"m","m"]
["ｋｍｐ１０ｓ１４",282,1371667450,"フィブラシートＡＫ－４０－５０ＣＭ",50,null,"m",null,null,"巻",0,null,"m","m"]
["ｋｍｐ１０ｗ３",283,null,null,null,null,null,null,null,null,0,null,"",""]
["ｋｍｐ１０ｗ１４",284,null,null,null,null,null,null,null,null,0,null,"",""]
["く２０２",285,1371792017,"インナープロテクト",17,null,"kg",null,null,null,0,null,"kg","kg"]
["くか",286,1371829017,"ドライプロテクト",17,null,"kg",null,null,null,0,null,"kg","kg"]
["１２",287,1154411010,"ＷＢ５０００",10,null,"kg",null,null,null,0,null,"kg","kg"]
["く９２８ｒｓ１０*",288,1336510016,"ビルテクト１００Ｅ",16,null,"kg",null,null,null,0,null,"kg","kg"]
["く９２８ｒｗ１０*",289,1336511016,"ビルテクト２００",16,null,"kg",null,null,null,0,null,"kg","kg"]
["く９２８ｒｓ１０",290,null,null,null,null,null,null,null,null,0,null,"",""]
["く９２８ｒｗ１０",291,null,null,null,null,null,null,null,null,0,null,"",""]
["く９２８ｒうぇこ",292,null,null,null,null,null,null,null,null,0,null,"",""]
["く９９９あ",293,null,null,null,null,null,null,null,null,0,null,"",""]
["く９９９か",294,null,null,null,null,null,null,null,null,0,null,"",""]
["ｋもるくいっく",295,null,null,null,null,null,null,null,null,0,null,"",""]
["ｋもるくいっくぷらいま",296,1370001450,"ボンド　ＭＧアンカーピン４５０",null,null,null,null,null,"本",{"$f":"E299*H299","v":0},null,"本","本"]
["ｍｇ４７０",297,1370001470,"ボンド　ＭＧアンカーピン４７０",null,null,null,null,null,"本",{"$f":"E300*H300","v":0},null,"本","本"]
["もｓ200ｂ",298,null,null,null,null,null,null,null,null,0,null,{"$f":"IF(D301=\"\",\"\",G301)","v":""},{"$f":"IF(D301=\"\",\"\",G301)","v":""}]
["もｓ200あ",299,null,null,null,null,null,null,null,null,0,null,"",""]
["ｍｐｘぐれ*",300,null,null,null,null,null,null,null,null,{"$f":"E303*H303","v":0},null,"",""]
["ｍｐｘほわ*",301,null,null,null,null,null,null,null,null,{"$f":"E304*H304","v":0},null,"",""]
["ｍｐｘぐれ",302,null,null,null,null,null,null,null,null,{"$f":"E305*H305","v":0},null,"",""]
["ｍｐｘほわ",303,null,null,null,null,null,null,null,null,{"$f":"E306*H306","v":0},null,"",""]
["ｍｓちえん",304,null,null,null,null,null,null,null,null,{"$f":"IF(A300=\"\",\"\",E438*H438)","v":0},null,"",""]
["ｍっそくしん",305,null,null,null,null,null,null,null,null,{"$f":"IF(A301=\"\",\"\",E439*H439)","v":0},null,"",""]
["ｍしょわ*",306,null,null,null,null,null,null,null,null,{"$f":"E440*H440","v":0},null,"",""]
[null,307,null,null,null,null,null,null,null,null,{"$f":"E441*H441","v":0},null,"",""]
["おっぐらうと",308,null,null,null,null,null,null,null,null,{"$f":"E326*H326","v":0},null,"",""]
["ｐっそくしん",309,null,null,null,null,null,null,null,null,{"$f":"E443*H443","v":0},null,"",""]
["ｐｓちえん",310,null,null,null,null,null,null,null,null,{"$f":"E313*H313","v":0},null,"",""]
["ｐｘ８０００",311,null,null,null,null,null,null,null,null,0,null,"",""]
["ｐもる*",312,"1157534003*","ボンド　Ｐモルタル",12,null,"kgset",null,null,"set",0,null,"kgset",{"$f":"IF(D315=\"\",\"\",G315)","v":"kgset"}]
["ｐもる",313,1157534003,"ボンド　Ｐモルタル骨材",3,null,"kg",null,null,"袋",0,null,{"$f":"IF(D316=\"\",\"\",G316)","v":"kg"},"kg"]
["ｑくりん２０",314,1154440260,"ボンド　マイクロクラック補修用プライマー",600,null,"gset",null,null,"set",0,null,"gset","gset"]
["ｒｍ18",315,null,null,null,null,null,null,null,null,0,null,{"$f":"IF(D318=\"\",\"\",G318)","v":""},{"$f":"IF(D318=\"\",\"\",G318)","v":""}]
["ス２００",316,null,null,null,null,null,null,null,null,0,null,"",""]
["す２５",317,1156535004,"ボンド　ユニエポ０１",4,null,"kg",null,null,"缶",0,null,"kg","kg"]
["たｇ１らいとぐ",318,1156558003,"ボンド　ユニエポカプセル４３６",0.3,null,"g",null,null,"個",{"$f":"E321*H321","v":0},null,{"$f":"IF(D321=\"\",\"\",G321)","v":"g"},{"$f":"IF(D321=\"\",\"\",G321)","v":"g"}]
["ｒ１",319,1156556006,"ボンド　ユニエポカプセル４５０",0.6,null,"g",null,null,"個",0,null,"g","g"]
["ｗ１",320,1156557008,"ボンド　ユニエポカプセル４７０",0.8,null,"g",null,null,"個",0,null,"g","g"]
["うｐ１",321,1156533004,"ボンド　ユニエポパウダーＣＧ１",4,null,"kg",null,null,"袋",0,null,"kg","kg"]
["うｐ",322,null,null,null,null,null,null,null,null,{"$f":"E321*H321","v":0},null,"",""]
["うｐ７００",323,1154176333,"ボンド　ＯＧグラウト",330,null,"ml",null,null,"本",{"$f":"E426*H426","v":0},null,"ml","ml"]
["うぐれ*",324,null,null,null,null,null,null,null,null,{"$f":"E323*H323","v":0},null,{"$f":"IF(D327=\"\",\"\",G327)","v":""},{"$f":"IF(D327=\"\",\"\",G327)","v":""}]
["うほわ*",325,null,null,null,null,null,null,null,null,{"$f":"E324*H324","v":0},null,"",""]
["うほわ",326,1158060018,"ボンド　ＡＵトップ",18,null,"kg",null,null,null,0,null,{"$f":"IF(D329=\"\",\"\",G329)","v":"kg"},{"$f":"IF(D329=\"\",\"\",G329)","v":"kg"}]
["うあい",327,1158061116,"ボンド　ＡＵトップうすめ液",16,null,"L",null,null,null,0,null,"L","L"]
["うあん",328,1154470016,"ボンド　ＶＭネットレス中塗り",16,null,"kgset",null,null,"set",0,null,"kgset","kgset"]
["うぐれ",329,1154473004,"ボンド　ＶＭネットレス下塗り",4,null,"kg",null,null,"袋",0,null,"kg","kg"]
["うぶら",330,1154489006,"ボンド　ＶＭクリア",6,null,"kgset",null,null,"set",0,null,"kgset","kgset"]
["うことｆ*",331,1154492004,"ボンド　ＶＭクリアプライマー",4,null,"kg",null,null,"缶",{"$f":"E260*H260","v":0},null,"kg","kg"]
["うことｆ",332,1154510006,"ボンド　ＶＭ－４",6.6,null,"kgset",null,null,"set",{"$f":"E261*H261","v":0},null,{"$f":"IF(D261=\"\",\"\",G261)","v":"kgset"},{"$f":"IF(D261=\"\",\"\",G261)","v":"kgset"}]
["うことうすめ",333,1154513221,"ボンド　ＶＭ－４　促進希釈剤",215,null,"g",null,null,"缶",{"$f":"E262*H262","v":0},null,"g","g"]
["ｖｆ０５０ん５０",334,null,null,null,null,null,null,null,null,{"$f":"E263*H263","v":0},null,{"$f":"IF(D337=\"\",\"\",G337)","v":""},{"$f":"IF(D337=\"\",\"\",G337)","v":""}]
["ｖｆ４１５ｒ５０",335,null,null,null,null,null,null,null,null,{"$f":"E507*H507","v":0},null,"",""]
["ｖｍ３",336,1154333013,"ボンド　ＶＭ３中塗り",13.5,null,"kgset",null,null,"set",{"$f":"E508*H508","v":0},null,"kgset","kgset"]
["ｖｍ３きしゃく",337,1154329227,"ボンド　ＶＭ３中塗り希釈剤",270,null,"g",null,null,"缶",0,null,"g","g"]
["ｖｍ*",338,"1371697001*","ボンド　ＶＭネット",100,null,"m",null,null,"巻",0,null,"m","m"]
[null,339,1371957001,"ボンド　ＨＳネット",100,null,"m",null,null,"巻",0,null,{"$f":"IF(D268=\"\",\"\",G268)","v":"m"},"m"]
["ｖｍぷらいま",340,1154331004,"ボンド　ＶＭプライマー",4,null,"kg",null,null,"缶",0,null,"kg","kg"]
["ｖｍそくしん",341,1154332280,"ボンド　ＶＭプライマー硬化促進剤",800,null,"g",null,null,"缶",0,null,"g","g"]
["ｖｐ４０",342,null,null,null,null,null,null,null,null,0,null,{"$f":"IF(D345=\"\",\"\",G345)","v":""},{"$f":"IF(D345=\"\",\"\",G345)","v":""}]
["ｖｐしーらー",343,null,null,null,null,null,null,null,null,0,null,"",""]
["ｖｐこうか",344,null,null,null,null,null,null,null,null,0,null,"",""]
["ｖｐこうか",345,null,null,null,null,null,null,null,null,0,null,"",""]
["ｖｐしゅ*",346,"1158503020*","ボンド　ＶＰセメントＬ",25,null,"kgset",null,null,"set",0,null,"kgset","kgset"]
["ｖｐしゅ",347,null,null,null,null,null,null,null,null,0,null,{"$f":"IF(D350=\"\",\"\",G350)","v":""},{"$f":"IF(D350=\"\",\"\",G350)","v":""}]
["ｖｐせめんとぷらいましゅ*",348,null,null,null,null,null,null,null,null,0,null,"",""]
["ｖｐせめんとぷらいましゅ",349,null,null,null,null,null,null,null,null,0,null,"",""]
["ｖｐふぃらーしゅ*",350,null,null,null,null,null,null,null,null,0,null,"",""]
["ｖｐふぃらーこうか",351,1154516012,"ボンド　ソルバインド　トップコート　主剤",12,null,"kg",null,null,"缶",0,null,"kg","kg"]
["ｖｐふぃらーしゅ",352,1154517003,"ボンド　ソルバインド　トップコート　硬化剤",3,null,"kg",null,null,"缶",0,null,"kg","kg"]
["ｗｆ１１８２０",353,1154518016,"ボンド　ソルバインド　中塗り",16,null,"kg",null,null,"缶",0,null,"kg","kg"]
["ｗｆ４１５ｒ５０",354,1154519004,"ボンド　ソルバインド　プライマー",4,null,"kg",null,null,"缶",0,null,"kg","kg"]
["ぜにやあぷり",355,null,null,null,null,null,null,null,null,0,null,{"$f":"IF(D358=\"\",\"\",G358)","v":""},{"$f":"IF(D358=\"\",\"\",G358)","v":""}]
["あくあとっぷ",356,1154407016,"ボンド　アクアトップコート",16,null,"kg",null,null,"缶",0,null,"kg","kg"]
[null,357,1154408016,"ボンド　アクアバインドＺⅡ",16,null,"kg",null,null,"缶",0,null,"kg","kg"]
["あくあ",358,1154406016,"ボンド　アクアバインドＺ",16,null,"kg",null,null,"缶",0,null,"kg","kg"]
["あくぐれ*",359,1154409004,"ボンド　アクアバインドプライマー",4,null,"kg",null,null,"缶",0,null,{"$f":"IF(D362=\"\",\"\",G362)","v":"kg"},{"$f":"IF(D362=\"\",\"\",G362)","v":"kg"}]
["あくほわ*",360,null,null,null,null,null,null,null,null,0,null,"",""]
["あくあい",361,null,null,null,null,null,null,null,null,0,null,"",""]
["あくぐれ",362,null,null,null,null,null,null,null,null,0,null,"",""]
["あくほわ",363,null,null,null,null,null,null,null,null,0,null,"",""]
["うれほわ*",364,null,null,null,null,null,null,null,null,0,null,"",""]
["えふほわ*",365,null,null,null,null,null,null,null,null,0,null,"",""]
["たいるほわ*",366,null,null,null,null,null,null,null,null,0,null,"",""]
["たいるｌｖぐれ*",367,null,null,null,null,null,null,null,null,0,null,"",""]
["おくがいようぱて",368,null,null,null,null,null,null,null,null,0,null,"",""]
["うわぬりしゅ*",369,null,null,null,null,null,null,null,null,0,null,"",""]
["うわぬりこうか",370,null,null,null,null,null,null,null,null,{"$f":"E373*H373","v":0},null,"",""]
["うわぬりしゅ",371,null,null,null,null,null,null,null,null,0,null,"",""]
["ｄｐ５０あるふぁ",372,null,null,null,null,null,null,null,null,0,null,"",""]
["かべほわ*",373,null,null,null,null,null,null,null,null,0,null,"",""]
["かべあい",374,null,null,null,null,null,null,null,null,0,null,"",""]
["かべかす",375,null,null,null,null,null,null,null,null,0,null,"",""]
["かべくり",376,null,null,null,null,null,null,null,null,0,null,"",""]
["かべだくせぴ",377,null,null,null,null,null,null,null,null,0,null,"",""]
["かべだくぶら",378,null,null,null,null,null,null,null,null,0,null,"",""]
["かべちぇりぶら",379,null,null,null,null,null,null,null,null,0,null,"",""]
["かべにゆべ",380,null,null,null,null,null,null,null,null,0,null,"",""]
["かべばち",381,null,null,null,null,null,null,null,null,0,null,"",""]
["かべぱすあい",382,null,null,null,null,null,null,null,null,0,null,"",""]
["かべぶらぶら",383,null,null,null,null,null,null,null,null,0,null,"",""]
["かべぶら",384,null,null,null,null,null,null,null,null,0,null,"",""]
["かべべじ",385,null,null,null,null,null,null,null,null,0,null,"",""]
["かべぺるほわ",386,null,null,null,null,null,null,null,null,0,null,"",""]
["かべほわ",387,null,null,null,null,null,null,null,null,0,null,"",""]
["かべほわぐれ",388,null,null,null,null,null,null,null,null,0,null,"",""]
["かべみでぶら",389,null,null,null,null,null,null,null,null,0,null,"",""]
["かべもく",390,1159253235,"ボンド　クイックセット３０",350,null,"kgset",null,null,"set",0,null,{"$f":"IF(D393=\"\",\"\",G393)","v":"kgset"},{"$f":"IF(D393=\"\",\"\",G393)","v":"kgset"}]
["かべらいあい",391,1159256001,"ボンド　クイックメンダー",1,null,"kgset",null,null,"set",0,null,"kgset","kgset"]
["かべらいおく",392,1159274001,"ボンド　クイックメンダー３０",1,null,"kgset",null,null,"set",0,null,"kgset","kgset"]
["かべらいぶら",393,null,null,null,null,null,null,null,null,0,null,"",""]
["かべらわ",394,null,null,null,null,null,null,null,null,0,null,"",""]
["かべれどぶら",395,null,null,null,null,null,null,null,null,0,null,"",""]
["かべとそう",396,null,null,null,null,null,null,null,null,0,null,"",""]
["きっちんて",397,null,null,null,null,null,null,null,null,0,null,"",""]
["きっちん２",398,null,null,null,null,null,null,null,null,0,null,"",""]
["くいっくせっと３０",399,null,null,null,null,null,null,null,null,{"$f":"E393*H393","v":0},null,"",""]
["くい１",400,null,null,null,null,null,null,null,null,{"$f":"E394*H394","v":0},null,"",""]
["くいっくめんだ３０",401,null,null,null,null,null,null,null,null,{"$f":"E395*H395","v":0},null,"",""]
["くりあとっぷはん*",402,1161770104,"ボンド　ＳＡシール",4,null,"Lset",null,null,"ｓｅｔ",0,null,"Lset","Lset"]
["くりあぷらいま",403,null,null,null,null,null,null,null,null,0,null,"",""]
[null,404,null,null,null,null,null,null,null,null,0,null,"",""]
["こくほわ",405,null,null,null,null,null,null,null,null,0,null,"",""]
["さい",406,1161611104,"ボンド　サイディングシール",4,null,"Lset",null,null,"set",0,null,"Lset","Lset"]
["ｓｄｃぐれｇｒ*",407,"1161680027*","ボンド　サイディングシール用カラーマスター　",160,null,"g",null,null,"個",0,null,"g","g"]
["さらん１０",408,null,null,null,null,null,null,null,null,0,null,"",""]
["しるからほわ*",409,null,null,null,null,null,null,null,null,0,null,"",""]
[null,410,1161950502,"ボンド　シールカラーマスター　特注色（Ｇ１７－６０Ｈ）",160,null,"g",null,null,"個",0,null,"g","g"]
["しるぷら１",411,1161937001,"ボンド　シールプライマー＃１土木用",1,null,"kg",null,null,"缶",0,null,"kg","kg"]
["しるぷら２",412,1161911250,"ボンド　シールプライマー＃２",500,null,"g",null,null,"缶",0,null,"g","g"]
["しるぷら３",413,1161912230,"ボンド　シールプライマー＃３",300,null,"g",null,null,"缶",0,null,"g","g"]
["しるぷら５",414,1161914250,"ボンド　シールプライマー＃５",500,null,"g",null,null,"缶",0,null,"g","g"]
["しるぷら１００",415,1162726210,"ボンド　シールプライマー＃７Ｎ",100,null,"g",null,null,"缶",0,null,"g","g"]
[null,416,null,null,null,null,null,null,null,null,0,null,"",""]
["しるぷらきわみ",417,1161871250,"ボンド　シールプライマー極用",500,null,"g",null,null,"缶",0,null,"g","g"]
["しりほわ*",418,null,null,null,null,null,null,null,null,0,null,"",""]
["しりんだみに",419,null,null,null,null,null,null,null,null,{"$f":"IF(A422=\"\",\"\",E49*H49)","v":0},null,"",""]
[null,420,null,null,null,null,null,null,null,null,{"$f":"E423*H423","v":0},null,"",""]
["ｚ１",421,null,null,null,null,null,null,null,null,0,null,"",""]
["ｚ２",422,null,null,null,null,null,null,null,null,0,null,"",""]
["ｚ３",423,1161087008,"ボンド　ＵＰシール＃７００　グレー",8,null,"kgset",null,null,"set",0,null,{"$f":"IF(D426=\"\",\"\",G426)","v":"kgset"},{"$f":"IF(D426=\"\",\"\",G426)","v":"kgset"}]
["ｓｈ６２０",424,null,null,null,null,null,null,null,null,0,null,"",""]
["きわみかん",425,1161870106,"ボンド　土木用シール極",6,null,"Ｌ",null,null,"缶",0,null,"Ｌ","Ｌ"]
["きわみかと",426,1161870332,"ボンド　土木用シール極",320,null,"ml",null,null,"本",0,null,"ml","ml"]
[null,427,1161870385,"ボンド　土木用シール極",850,null,"ml",null,null,"本",{"$f":"E430*H430","v":0},null,{"$f":"IF(D430=\"\",\"\",G430)","v":"ml"},{"$f":"IF(D430=\"\",\"\",G430)","v":"ml"}]
["はいぐれ*",428,null,null,null,null,null,null,null,null,0,null,{"$f":"IF(D431=\"\",\"\",G431)","v":""},{"$f":"IF(D431=\"\",\"\",G431)","v":""}]
["はくりぷらいま",429,1111679210,"ボンド　はくりプライマー",100,null,"g",null,null,"個",0,null,"g","g"]
[null,430,null,null,null,null,null,null,null,null,0,null,"",""]
["びゅそくしん",431,1161556030,"ボンド　ビューシール６９０９硬化促進剤",30,null,"g",null,null,"個",0,null,"g","g"]
["ふっそ３００",432,null,null,null,null,null,null,null,null,0,null,"",""]
["びゅちえん",433,1161565040,"ボンド　ポリウレタン系建築用硬化遅延剤",40,null,"g",null,null,"個",0,null,"g","g"]
["まいくろ",434,null,null,null,null,null,null,null,null,0,null,"",""]
["もっこうあぷり",435,1161563040,"ボンド　ＭＳ・ＦＲ・サイディング硬化遅延剤",40,null,"g",null,null,"個",0,null,"g","g"]
["ゆかび",436,1161560040,"ボンド　ＭＳ・ＦＲシール硬化促進剤",40,null,"g",null,null,"個",0,null,"g","g"]
["ゆにえぽ０１",437,null,null,null,null,null,null,null,null,0,null,"",""]
[null,438,null,null,null,null,null,null,null,null,0,null,"",""]
["ゆにえぽかぷせる４３６*",439,null,null,null,null,null,null,null,null,0,null,"",""]
["ゆにえぽかぷせる４５０*",440,1161562050,"ボンド　ＰＳシール硬化促進剤",50,null,"g",null,null,"個",0,null,"g","g"]
["ゆにえぽかぷせる４７０*",441,null,null,null,null,null,null,null,null,0,null,"",""]
["ゆにえぽかぷせる４３６",442,null,null,null,null,null,null,null,null,0,null,"",""]
["ゆにえぽかぷせる４５０",443,null,null,null,null,null,null,null,null,0,null,"",""]
["ゆにえぽかぷせる４７０",444,null,null,null,null,null,null,null,null,0,null,"",""]
["ゆにえぽぱうだｃｇ１",445,null,null,null,null,null,null,null,null,0,null,"",""]
["れべるわん",446,null,null,null,null,null,null,null,null,0,null,"",""]
["ゆか",447,null,null,null,null,null,null,null,null,0,null,"",""]
["ぞうさく",448,null,null,null,null,null,null,null,null,0,null,"",""]
["たいかぐれ*",449,"1162104333*","ボンド　耐火目地用シーラント",333,null,"ml",null,null,"本",0,null,"ml","ml"]
["たいかほわ*",450,null,null,null,null,null,null,null,null,0,null,"",""]
["たいかぐれ",451,1162104333,"ボンド　耐火目地用シーラント　グレー",333,null,"ml",null,null,"本",0,null,"ml","ml"]
["たいかほわ",452,1162103333,"ボンド　耐火目地用シーラント　ホワイト",333,null,"ml",null,null,"本",0,null,"ml","ml"]
["たいねつはけぬりｈｇ３",453,null,null,null,null,null,null,null,null,0,null,"",""]
["へんほわ*",454,"1162703333*","ボンド　変成シリコンコーク",333,null,"ml",null,null,"本",0,null,"ml","ml"]
["へんぐれ*",455,null,null,null,null,null,null,null,null,0,null,"",""]
["へんあい",456,1162706333,"ボンド　変成シリコンコーク　アイボリー",333,null,"ml",null,null,"本",0,null,"ml","ml"]
["へんぐれ",457,1162702333,"ボンド　変成シリコンコーク　グレー",333,null,"ml",null,null,"本",0,null,"ml","ml"]
["へんぶら",458,1162693333,"ボンド　変成シリコンコーク　ブラック",333,null,"ml",null,null,"本",0,null,"ml","ml"]
["へんぶろ",459,1162705333,"ボンド　変成シリコンコーク　ブロンズ",333,null,"ml",null,null,"本",0,null,"ml","ml"]
["へんほわ",460,1162703333,"ボンド　変成シリコンコーク　ホワイト",333,null,"ml",null,null,"本",0,null,"ml","ml"]
["へんらいとぐ",461,1162427333,"ボンド　変成シリコンコーク　ライトグレー",333,null,"ml",null,null,"本",0,null,"ml","ml"]
["へんｑぐれ*",462,"1164921333*","ボンド　変成シリコンコークＱ　",333,null,"ml",null,null,"本",0,null,"ml","ml"]
["へんｑちゅぶぐれ*",463,"1171534312*","ボンド　変成シリコンコークＱチューブ　",120,null,"ml",null,null,"本",0,null,"ml","ml"]
["ぼうすいしたじ",464,1163055332,"ボンド　防水下地コークＱ　グレー",320,null,"ml",null,null,"本",0,null,"ml","ml"]
["ぼうほわ*",465,"1162579333*","ボンド　防黴剤入りシリコンコーク",330,null,"ml",null,null,"本",0,null,"ml","ml"]
["ぼうらいとぐ*",466,null,null,null,null,null,null,null,null,0,null,"",""]
["ぼうあい",467,1162581333,"ボンド　防黴剤入りシリコンコーク　アイボリー",330,null,"ml",null,null,"本",0,null,"ml","ml"]
["ぼうくり",468,1162582333,"ボンド　防黴剤入りシリコンコーク　クリヤー",330,null,"ml",null,null,"本",0,null,"ml","ml"]
["ぼうそふあい",469,1162584333,"ボンド　防黴剤入りシリコンコーク　ソフトアイボリー",330,null,"ml",null,null,"本",0,null,"ml","ml"]
["ぼうだくあい",470,1162580333,"ボンド　防黴剤入りシリコンコーク　ダークアイボリー",330,null,"ml",null,null,"本",0,null,"ml","ml"]
["ぼうほわ",471,1162579333,"ボンド　防黴剤入りシリコンコーク　ホワイト",330,null,"ml",null,null,"本",0,null,"ml","ml"]
["ぼうらいとぐ",472,1162583333,"ボンド　防黴剤入りシリコンコーク　ライトグレー",330,null,"ml",null,null,"本",0,null,"ml","ml"]
["ｈｇ４",473,null,null,null,null,null,null,null,null,0,null,"",""]
[null,474,1156849008,"ボンド　ＥＭＳセグメントシール",8,null,"kgset",null,null,"set",{"$f":"E331*H331","v":0},null,{"$f":"IF(D331=\"\",\"\",G331)","v":"kgset"},{"$f":"IF(D331=\"\",\"\",G331)","v":"kgset"}]
[null,475,null,null,null,null,null,null,null,null,{"$f":"E332*H332","v":0},null,{"$f":"IF(D478=\"\",\"\",G478)","v":""},{"$f":"IF(D478=\"\",\"\",G478)","v":""}]
[null,476,null,null,null,null,null,null,null,null,{"$f":"E333*H333","v":0},null,"",""]
[null,477,null,null,null,null,null,null,null,null,{"$f":"E334*H334","v":0},null,"",""]
[null,478,null,null,null,null,null,null,null,null,{"$f":"E335*H335","v":0},null,"",""]
[null,479,null,null,null,null,null,null,null,null,0,null,"",""]
[null,480,null,null,null,null,null,null,null,null,0,null,"",""]
[null,481,null,null,null,null,null,null,null,null,0,null,"",""]
[null,482,null,null,null,null,null,null,null,null,0,null,"",""]
[null,483,null,null,null,null,null,null,null,null,0,null,"",""]
[null,484,null,null,null,null,null,null,null,null,{"$f":"E487*H487","v":0},null,"",""]
[null,485,null,null,null,null,null,null,null,null,0,null,"",""]
[null,486,null,null,null,null,null,null,null,null,0,null,"",""]
[null,487,null,null,null,null,null,null,null,null,0,null,"",""]
[null,488,null,null,null,null,null,null,null,null,0,null,"",""]
[null,489,null,null,null,null,null,null,null,null,0,null,"",""]
[null,490,null,null,null,null,null,null,null,null,0,null,"",""]
[null,491,null,null,null,null,null,null,null,null,0,null,"",""]
[null,492,null,null,null,null,null,null,null,null,0,null,"",""]
[null,493,null,null,null,null,null,null,null,null,0,null,"",""]
[null,494,null,null,null,null,null,null,null,null,0,null,"",""]
[null,495,null,null,null,null,null,null,null,null,0,null,"",""]
[null,496,null,null,null,null,null,null,null,null,0,null,"",""]
[null,497,null,null,null,null,null,null,null,null,0,null,"",""]
[null,498,null,null,null,null,null,null,null,null,{"$f":"E501*H501","v":0},null,"",""]
[null,499,null,null,null,null,null,null,null,null,{"$f":"E502*H502","v":0},null,"",""]
[null,500,null,null,null,null,null,null,null,null,{"$f":"E503*H503","v":0},null,"",""]
[null,501,null,null,null,null,null,null,null,null,{"$f":"E504*H504","v":0},null,"",""]
[null,502,null,null,null,null,null,null,null,null,{"$f":"E505*H505","v":0},null,"",""]
[null,503,null,null,null,null,null,null,null,null,0,null,"",""]
[null,504,1146009003,"ボンド　Ｇ１０Ｚ",3,null,"kg",null,null,"缶",0,null,"kg","kg"]
[null,505,1146053015,"ボンド　Ｇ１１Ｚ",15,null,"kg",null,null,"缶",0,null,"kg","kg"]
[null,506,null,null,null,null,null,null,null,null,0,null,{"$f":"IF(D509=\"\",\"\",G509)","v":""},{"$f":"IF(D509=\"\",\"\",G509)","v":""}]
[null,507,null,null,null,null,null,null,null,null,0,null,"",""]
[null,508,null,null,null,null,null,null,null,null,0,null,"",""]
[null,509,null,null,null,null,null,null,null,null,0,null,"",""]
[null,510,null,null,null,null,null,null,null,null,0,null,"",""]
[null,511,1161597106,"ボンド　ビューシール６９０９",6,null,"Lset",null,null,"set",{"$f":"E514*H514","v":0},null,{"$f":"IF(D514=\"\",\"\",G514)","v":"Lset"},{"$f":"IF(D514=\"\",\"\",G514)","v":"Lset"}]
[null,512,"1162505332*","ボンド　ウレタンコーク",320,null,"ml",null,null,"本",0,null,"ml","ml"]
[null,513,1162503332,"ボンド　ウレタンコーク　アイボリー",320,null,"ml",null,null,"本",0,null,"ml","ml"]
[null,514,1162504332,"ボンド　ウレタンコーク　アンバー",320,null,"ml",null,null,"本",0,null,"ml","ml"]
[null,515,1162505332,"ボンド　ウレタンコーク　グレー",320,null,"ml",null,null,"本",0,null,"ml","ml"]
[null,516,1162507332,"ボンド　ウレタンコーク　ブラック",320,null,"ml",null,null,"本",0,null,"ml","ml"]
[null,517,1162506332,"ボンド　ウレタンコーク　ホワイト",320,null,"ml",null,null,"本",0,null,"ml","ml"]
[null,518,1162513332,"ボンド　ウレタンコーク　ライトグレー",320,null,"ml",null,null,"本",0,null,"ml","ml"]
[null,519,null,null,null,null,null,null,null,null,{"$f":"E522*H522","v":0},null,"",""]
[null,520,null,null,null,null,null,null,null,null,0,null,"",""]
[null,521,null,null,null,null,null,null,null,null,0,null,"",""]
[null,522,null,null,null,null,null,null,null,null,0,null,"",""]
[null,523,null,null,null,null,null,null,null,null,0,null,"",""]
[null,524,null,null,null,null,null,null,null,null,0,null,"",""]
[null,525,null,null,null,null,null,null,null,null,0,null,"",""]
[null,526,null,null,null,null,null,null,null,null,0,null,"",""]
[null,527,null,null,null,null,null,null,null,null,0,null,"",""]
[null,528,null,null,null,null,null,null,null,null,0,null,"",""]
[null,529,null,null,null,null,null,null,null,null,0,null,"",""]
[null,530,null,null,null,null,null,null,null,null,0,null,"",""]
[null,531,null,null,null,null,null,null,null,null,0,null,"",""]
[null,532,null,null,null,null,null,null,null,null,0,null,"",""]
[null,533,null,null,null,null,null,null,null,null,0,null,"",""]
[null,534,null,null,null,null,null,null,null,null,0,null,"",""]
[null,535,null,null,null,null,null,null,null,null,0,null,"",""]
[null,536,null,null,null,null,null,null,null,null,0,null,"",""]
[null,537,null,null,null,null,null,null,null,null,0,null,"",""]
[null,538,null,null,null,null,null,null,null,null,0,null,"",""]
[null,539,null,null,null,null,null,null,null,null,0,null,"",""]
[null,540,null,null,null,null,null,null,null,null,0,null,"",""]
[null,541,null,null,null,null,null,null,null,null,0,null,"",""]
[null,542,null,null,null,null,null,null,null,null,0,null,"",""]
[null,543,null,null,null,null,null,null,null,null,0,null,"",""]
[null,544,null,null,null,null,null,null,null,null,0,null,"",""]
[null,545,null,null,null,null,null,null,null,null,0,null,"",""]
[null,546,null,null,null,null,null,null,null,null,0,null,"",""]
[null,547,null,null,null,null,null,null,null,null,0,null,"",""]
[null,548,null,null,null,null,null,null,null,null,0,null,"",""]
[null,549,null,null,null,null,null,null,null,null,0,null,"",""]
[null,550,null,null,null,null,null,null,null,null,0,null,"",""]
[null,551,null,null,null,null,null,null,null,null,0,null,"",""]
[null,552,null,null,null,null,null,null,null,null,0,null,"",""]
[null,553,null,null,null,null,null,null,null,null,0,null,"",""]
[null,554,null,null,null,null,null,null,null,null,0,null,"",""]
[null,555,null,null,null,null,null,null,null,null,0,null,"",""]
[null,556,null,null,null,null,null,null,null,null,0,null,"",""]
[null,557,null,null,null,null,null,null,null,null,0,null,"",""]
[null,558,null,null,null,null,null,null,null,null,0,null,"",""]
[null,559,null,null,null,null,null,null,null,null,0,null,"",""]
[null,560,null,null,null,null,null,null,null,null,0,null,"",""]
[null,561,null,null,null,null,null,null,null,null,0,null,"",""]
[null,562,null,null,null,null,null,null,null,null,0,null,"",""]
[null,563,null,null,null,null,null,null,null,null,0,null,"",""]
[null,564,null,null,null,null,null,null,null,null,0,null,"",""]
[null,565,null,null,null,null,null,null,null,null,0,null,"",""]
[null,566,null,null,null,null,null,null,null,null,0,null,"",""]
[null,567,null,null,null,null,null,null,null,null,0,null,{"$f":"IF(D570=\"\",\"\",G570)","v":""},{"$f":"IF(D570=\"\",\"\",G570)","v":""}]
[null,568,null,null,null,null,null,null,null,null,0,null,"",""]
[null,569,null,null,null,null,null,null,null,null,0,null,"",""]
[null,570,null,null,null,null,null,null,null,null,0,null,"",""]