{"text_format":"1","workbook":"xlsx","n_sheets":7,"sheets":["0000","入力シート","出荷証明書雛型","VLOOK","シール保証書（作成見本）","エポ保証書（作成見本）","試験成績書(依頼書)"],"not_rendered":{"charts":0,"images":2,"macros":1,"external_links":0,"defined_names":14,"comments":2,"pivot_tables":0},"unopened":[],"bounds":{"document_bytes":16777216,"sheet_cells":100000,"rows_first":2000,"rows_last":500,"rows_between":2000,"halvings":0,"cell_chars":16384,"cell_head_chars":4096},"cells_cut":0,"cells_raw":0,"read":"whole","date_system":"1900"}

{"sheet":"0000","index":0,"n_rows":0,"n_cols":0,"rows_kept":0,"cut":false,"hidden":true,"merged":[]}

{"sheet":"入力シート","index":1,"n_rows":94,"n_cols":7,"rows_kept":94,"cut":false,"hidden":false,"merged":[[93,1,94,1],[93,2,94,2],[72,4,72,5]]}
[null,null,"＊マクロは必ず有効にしてください。",null,null,"＊訂正依頼する場合は訂正箇所の色を変えてください。"]
[null,"出荷証明書","商品明細は「出荷証明書雛型」タブに記入",null,null,"記入例"]
[null,"工事名称",null,null,null,"〇〇大規模修繕工事"]
[null,"出荷証明書宛名①",null,"御中","←敬称入力","〇〇管理組合","御中"]
[null,"元請会社①",null,null,null,"株式会社△△△建設"]
[null,"施工会社①",null,null,null,"□□□工業株式会社"]
[null,"出荷証明書宛名②",null,"御中","←敬称入力","〇　〇〇","様"]
[null,"元請会社②",null,null,null,"1234株式会社"]
[null,"施工会社②",null,null,null,"9999株式会社"]
[null,"書類発行日",null,null,null,"2022-04-01"]
[]
[null,"保証書（シール）","「シール保証書（作成見本）」タブで提出書類が確認できます。",null,null,"記入例"]
[null,"工事名称",{"$f":"C3","v":0},null,"出荷証明書から\nリンク","〇〇大規模修繕工事"]
[null,"保証書宛名①",{"$f":"C4","v":0},{"$f":"D4","v":"御中"},"出荷証明書から\nリンク","〇〇管理組合","御中"]
[null,"施工会社①",{"$f":"C6","v":0},null,"出荷証明書から\nリンク","□□□工業株式会社"]
[null,"保証書宛名②",{"$f":"C7&\"\"","v":""},{"$f":"D7","v":"御中"},"出荷証明書から\nリンク","〇　〇〇","様"]
[null,"施工会社②",{"$f":"C9&\"\"","v":""},null,"出荷証明書から\nリンク","□□□建設株式会社"]
[null,"書類発行日",null,null,null,"2022-05-01"]
[null,"現場住所",null,null,null,"東京都千代田区神田錦町444-4"]
[null,"施工箇所",null,null,null,"打継目地、建具、サッシ廻り目地他"]
{"$rows_left_out":75}
{"sheet":"出荷証明書雛型","index":2,"n_rows":125,"n_cols":39,"rows_kept":125,"cut":false,"hidden":false,"merged":[[81,2,81,7],[81,8,81,9],[81,11,81,12],[81,14,81,15],[84,2,84,6],[82,2,82,7],[82,8,82,9],[82,11,82,12],[82,14,82,15],[83,2,83,7],[83,8,83,9],[83,11,83,12],[83,14,83,15],[78,2,78,7],[78,8,78,9],[78,11,78,12],[78,14,78,15],[79,2,79,7],[79,8,79,9],[79,11,79,12],[79,14,79,15],[80,2,80,7],[80,8,80,9],[80,11,80,12],[80,14,80,15],[75,2,75,7],[75,8,75,9],[75,11,75,12],[75,14,75,15],[76,2,76,7],[76,8,76,9],[76,11,76,12],[76,14,76,15],[77,2,77,7],[77,8,77,9],[77,11,77,12],[77,14,77,15],[72,2,72,7],[72,8,72,9],[72,11,72,12],[72,14,72,15],[73,2,73,7],[73,8,73,9],[73,11,73,12],[73,14,73,15],[74,2,74,7],[74,8,74,9],[74,11,74,12],[74,14,74,15],[69,2,69,7],[69,8,69,9],[69,11,69,12],[69,14,69,15],[70,2,70,7],[70,8,70,9],[70,11,70,12],[70,14,70,15],[71,2,71,7],[71,8,71,9],[71,11,71,12],[71,14,71,15],[66,2,66,7],[66,8,66,9],[66,11,66,12],[66,14,66,15],[67,2,67,7],[67,8,67,9],[67,11,67,12],[67,14,67,15],[68,2,68,7],[68,8,68,9],[68,11,68,12],[68,14,68,15],[63,2,63,7],[63,8,63,9],[63,11,63,12],[63,14,63,15],[64,2,64,7],[64,8,64,9],[64,11,64,12],[64,14,64,15],[65,2,65,7],[65,8,65,9],[65,11,65,12],[65,14,65,15],[60,1,60,2],[61,2,61,7],[61,8,61,10],[61,11,61,13],[61,14,61,16],[62,2,62,7],[62,8,62,9],[62,11,62,12],[62,14,62,15],[45,2,47,12],[49,10,49,16],[50,1,50,5],[53,1,53,2],[53,3,54,16],[54,1,54,2],[55,1,56,2],[55,3,56,16],[57,1,58,2],[57,3,58,16],[39,2,39,6],[37,2,37,7],[37,8,37,9],[37,11,37,12],[29,14,29,15],[30,2,30,7],[30,8,30,9],[30,11,30,12],[30,14,30,15],[38,2,38,7],[38,8,38,9],[38,11,38,12],[38,14,38,15],[35,2,35,7],[33,11,33,12],[33,14,33,15],[37,14,37,15],[36,2,36,7],[36,8,36,9],[36,11,36,12],[31,11,31,12],[31,14,31,15],[32,2,32,7],[32,8,32,9],[36,14,36,15],[35,14,35,15],[35,8,35,9],[35,11,35,12],[31,8,31,9],[34,2,34,7],[34,8,34,9],[34,11,34,12],[34,14,34,15],[32,11,32,12],[31,2,31,7],[27,2,27,7],[27,8,27,9],[27,11,27,12],[27,14,27,15],[33,2,33,7],[33,8,33,9],[28,2,28,7],[28,8,28,9],[28,11,28,12],[28,14,28,15],[32,14,32,15],[29,2,29,7],[29,8,29,9],[29,11,29,12],[24,2,24,7],[24,8,24,9],[24,11,24,12],[24,14,24,15],[25,2,25,7],[25,8,25,9],[25,11,25,12],[25,14,25,15],[26,8,26,9],[26,11,26,12],[26,14,26,15],[26,2,26,7],[21,2,21,7],[21,8,21,9],[21,11,21,12],[21,14,21,15],[20,2,20,7],[20,8,20,9],[20,11,20,12],[20,14,20,15],[23,2,23,7],[23,8,23,9],[23,11,23,12],[23,14,23,15],[22,2,22,7],[22,8,22,9],[22,11,22,12],[22,14,22,15],[17,2,17,7],[17,8,17,9],[17,11,17,12],[17,14,17,15],[16,2,16,7],[16,8,16,10],[16,11,16,13],[16,14,16,16],[19,2,19,7],[19,8,19,9],[19,11,19,12],[19,14,19,15],[18,2,18,7],[18,8,18,9],[18,11,18,12],[18,14,18,15],[13,34,13,35],[15,1,15,2],[15,31,15,32],[15,34,15,35],[10,34,10,35],[11,31,11,32],[11,34,11,35],[12,1,13,2],[12,3,13,16],[12,31,12,32],[13,19,14,33],[4,34,4,35],[5,1,5,5],[5,31,5,32],[5,34,5,35],[0,2,2,12],[4,10,4,16],[4,31,4,32],[12,34,12,35],[6,31,6,32],[6,34,6,35],[8,1,8,2],[8,3,9,16],[8,31,8,32],[8,34,8,35],[9,1,9,2],[9,31,9,32],[9,34,9,35],[10,1,11,2],[10,3,11,16],[10,31,10,32],[0,18,4,22]]}
[null,null,"出　　荷　　証　　明　　書",null,null,null,null,null,null,null,null,null,null,null,null,null,null,null,{"$f":"IF(入力シート!C7=\"\",\"\",\"宛名違い有り　　　　　　　　　　　　　↓参照\")","v":""},null,null,null,null,null,null,null,null,null,null,null,null,null,null,null,null,null,null,1]
[null,null,null,null,null,null,null,null,null,null,null,null,null,null,null,null,null,null,null,null,null,null,null,null,null,null,null,null,null,null,null,null,null,null,null,null,null,1]
[null,null,null,null,null,null,null,null,null,null,null,null,null,null,null,null,null,null,null,null,null,null,null,null,null,null,null,null,null,null,null,null,null,null,null,null,null,1]
[null,null,null,null,null,null,null,null,null,null,null,null,null,null,null,null,null,null,null,null,null,null,null,null,null,null,null,null,null,null,null,null,null,null,null,null,null,1]
[null,null,null,null,null,null,null,null,null,null,{"$f":"IF(入力シート!C10=\"\",\"　　年　　　 月　　　 日\",入力シート!C10)","v":"　　年　　　 月　　　 日"},null,null,null,null,null,null,null,null,null,null,null,null,null,null,null,null,null,null,null,null,null,null,null,null,null,null,1]
[null,{"$f":"入力シート!C4","v":0},null,null,null,null,{"$f":"入力シート!D4","v":"御中"},null,null,null,null,null,null,null,null,null,null,null,null,null,null,null,null,null,null,null,null,null,null,null,null,null,null,null,null,null,null,1]
[null,null,null,null,null,null,null,null,null,null,null,null,null,null,null,null,null,null,null,null,null,null,null,null,null,null,null,null,null,null,null,null,null,null,null,null,null,1]
[null,null,null,null,null,null,null,null,null,null,null,null,null,null,null,null,null,null,null,null,null,null,null,null,null,null,null,null,null,null,null,null,null,null,null,null,null,1]
[null,"工　事　名　称",null,{"$f":"入力シート!C3","v":0},null,null,null,null,null,null,null,null,null,null,null,null,null,null,null,null,null,null,null,null,null,null,null,null,null,null,null,null,null,null,null,null,null,1]
[null,"（現　場　名）",null,null,null,null,null,null,null,null,null,null,null,null,null,null,null,null,null,null,null,null,null,null,null,null,null,null,null,null,null,null,null,null,null,null,null,1]
[null,"元　請　業　者",null,{"$f":"入力シート!C5&\"\"","v":""},null,null,null,null,null,null,null,null,null,null,null,null,null,null,null,null,null,null,null,null,null,null,null,null,null,null,null,null,null,null,null,null,null,1]
[null,null,null,null,null,null,null,null,null,null,null,null,null,null,null,null,null,null,null,null,null,null,null,null,null,null,null,null,null,null,null,null,null,null,null,null,null,1]
[null,"施　工　業　者",null,{"$f":"入力シート!C6&\"\"","v":""},null,null,null,null,null,null,null,null,null,null,null,null,null,null,null,null,null,null,null,null,null,null,null,null,null,null,null,null,null,null,null,null,null,1]
[null,null,null,null,null,null,null,null,null,null,null,null,null,null,null,null,null,null,null,"ＮＯ入力一覧　（無いものは「ＶＬＯＯＫ」タブ参照）",null,null,null,null,null,null,null,null,null,null,null,null,null,null,null,null,null,1]
[null,null,null,null,null,null,null,null,null,null,null,null,null,null,null,null,null,null,null,null,null,null,null,null,null,null,null,null,null,null,null,null,null,null,null,null,null,1]
[null,"出　荷　内　容",null,null,null,null,null,null,null,null,null,null,null,null,null,null,null,null,null,null,"エポキシ系",null,null,null,null,"エポキシ系",null,null,null,null,"シーリング材",null,null,null,null,null,null,1]
[null,"出荷年月日","品　　　　　名",null,null,null,null,null,"荷姿",null,null,"出荷単位",null,null,"出荷量",null,null,"NO入力",null,"ＮＯ","品　　　　　名","荷姿",null,null,"ＮＯ","品　　　　　名","荷姿",null,null,"ＮＯ","品　　　　　名","荷姿",null,null,null,null,null,1]
[{"$f":"IF(R18=\"\",\"\",VLOOKUP(R18,VLOOK!$B$3:$M$511,2,FALSE))","v":""},null,{"$f":"IF(A18=\"\",\"\",VLOOKUP(A18,VLOOK!$C$3:$M$511,2,FALSE))","v":""},null,null,null,null,null,{"$f":"IF(A18=\"\",\"\",VLOOKUP(A18,VLOOK!$C$3:$M$448,3,FALSE))&\"\"","v":""},null,{"$f":"IF(A18=\"\",\"\",VLOOKUP(A18,VLOOK!$C$3:$M$448,5,FALSE))&\"\"","v":""},null,null,{"$f":"IF(A18=\"\",\"\",VLOOKUP(A18,VLOOK!$C$3:$M$448,8,FALSE))&\"\"","v":""},{"$f":"IFERROR(IF(C18=\"\",\"\",I18*L18),\"\")","v":""},null,{"$f":"IF(A18=\"\",\"\",VLOOKUP(A18,VLOOK!$C$3:$M$448,11,FALSE))&\"\"","v":""},null,null,"0","以下余白",null,null,null,30,"ボンドＥ２４２０",3,"ｋｇ",null,48,"ボンドＭＳシール",4,null,"Ｌ",null,null,null,1]
[{"$f":"IF(R19=\"\",\"\",VLOOKUP(R19,VLOOK!$B$3:$M$511,2,FALSE))","v":""},null,{"$f":"IF(A19=\"\",\"\",VLOOKUP(A19,VLOOK!$C$3:$M$511,2,FALSE))","v":""},null,null,null,null,null,{"$f":"IF(A19=\"\",\"\",VLOOKUP(A19,VLOOK!$C$3:$M$448,3,FALSE))&\"\"","v":""},null,{"$f":"IF(A19=\"\",\"\",VLOOKUP(A19,VLOOK!$C$3:$M$448,5,FALSE))&\"\"","v":""},null,null,{"$f":"IF(A19=\"\",\"\",VLOOKUP(A19,VLOOK!$C$3:$M$448,8,FALSE))&\"\"","v":""},{"$f":"IFERROR(IF(C19=\"\",\"\",I19*L19),\"\")","v":""},null,{"$f":"IF(A19=\"\",\"\",VLOOKUP(A19,VLOOK!$C$3:$M$448,11,FALSE))&\"\"","v":""},null,null,1,"ボンドＥ２０６",3,"ｋｇ",null,31,"ボンドＥ２４２０D",3,"ｋｇ",null,49,"ボンドＰＳシール",4,null,"Ｌ",null,null,null,1]
[{"$f":"IF(R20=\"\",\"\",VLOOKUP(R20,VLOOK!$B$3:$M$511,2,FALSE))","v":""},null,{"$f":"IF(A20=\"\",\"\",VLOOKUP(A20,VLOOK!$C$3:$M$511,2,FALSE))","v":""},null,null,null,null,null,{"$f":"IF(A20=\"\",\"\",VLOOKUP(A20,VLOOK!$C$3:$M$448,3,FALSE))&\"\"","v":""},null,{"$f":"IF(A20=\"\",\"\",VLOOKUP(A20,VLOOK!$C$3:$M$448,5,FALSE))&\"\"","v":""},null,null,{"$f":"IF(A20=\"\",\"\",VLOOKUP(A20,VLOOK!$C$3:$M$448,8,FALSE))&\"\"","v":""},"",null,{"$f":"IF(A20=\"\",\"\",VLOOKUP(A20,VLOOK!$C$3:$M$448,11,FALSE))&\"\"","v":""},null,null,2,"ボンドＥ２０６Ｓ",3,"ｋｇ",null,32,"ボンドＫモルタル",6,"ｋｇ",null,50,"ボンドビューシール６９０９",6,null,"Ｌ",null,null,null,1]
{"$rows_left_out":106}
{"sheet":"VLOOK","index":3,"n_rows":416,"n_cols":14,"rows_kept":416,"cut":false,"hidden":false,"merged":[]}
[null,0,1,2,3,4,5,6,7,8,9,10,11]
[null,"ＮＯ","コード","品　　　　　名","荷姿",null,null,"出荷単位",null,null,"出荷量"]
[null,0,1,"以下余白"]
["え２０６ｓ*",1,"1156015003*","ボンドＥ２０６",3,null,"ｋｇ",null,null,"set",{"$f":"E4*H4","v":0},null,{"$f":"IF(D4=\"\",\"\",G4)","v":"ｋｇ"}]
["え２０６ｓ",2,1156015003,"ボンドＥ２０６Ｓ",3,null,"ｋｇ",null,null,"set",0,null,"ｋｇ"]
["え２０６ｗ",3,1156090003,"ボンドＥ２０６Ｗ",3,null,"ｋｇ",null,null,"set",0,null,"ｋｇ"]
["え２０７ｄｓ*",4,"1156190003*","ボンドＥ２０７Ｄ",3,null,"ｋｇ",null,null,"set",0,null,"ｋｇ"]
["え２０７ｄｓ",5,1156190003,"ボンドＥ２０７ＤＳ",3,null,"ｋｇ",null,null,"set",0,null,"ｋｇ"]
["え２０７ｄｗ",6,1156641003,"ボンドＥ２０７ＤＷ",3,null,"ｋｇ",null,null,"set",0,null,"ｋｇ"]
["え２０８ｓ*",7,"1156063003*","ボンドＥ２０８",3,null,"ｋｇ",null,null,"set",0,null,"ｋｇ"]
["え２０８ｓ",8,1156063003,"ボンドＥ２０８Ｓ",3,null,"ｋｇ",null,null,"set",0,null,"ｋｇ"]
["え２０８ｗ",9,1156093003,"ボンドＥ２０８Ｗ",3,null,"ｋｇ",null,null,"set",0,null,"ｋｇ"]
[null,10,1156064003,"ボンドＥ２０８ＳＳ",3,null,"ｋｇ",null,null,"set",{"$f":"E13*H13","v":0},null,{"$f":"IF(D13=\"\",\"\",G13)","v":"ｋｇ"}]
["え２０９ｓ３*",11,"1156045003*","ボンドＥ２０９",3,null,"ｋｇ",null,null,"set",0,null,"ｋｇ"]
["え２０９ｓ３",12,1156045003,"ボンドＥ２０９Ｓ",3,null,"ｋｇ",null,null,"set",0,null,"ｋｇ"]
["え２０９ｗ３",13,1156042003,"ボンドＥ２０９Ｗ",3,null,"ｋｇ",null,null,"set",0,null,"ｋｇ"]
["え２０９ｓ６*",14,"1156045006*","ボンドＥ２０９",6,null,"ｋｇ",null,null,"set",0,null,"ｋｇ"]
["え２０９ｓ６",15,1156045006,"ボンドＥ２０９Ｓ",6,null,"ｋｇ",null,null,"set",0,null,"ｋｇ"]
["え２０９ｗ６",16,1156182006,"ボンドＥ２０９Ｗ",6,null,"ｋｇ",null,null,"set",0,null,"ｋｇ"]
[null,17,1156195006,"ボンドＥ２０９ＳＳ",6,null,"ｋｇ",null,null,"set",{"$f":"E20*H20","v":0},null,{"$f":"IF(D20=\"\",\"\",G20)","v":"ｋｇ"}]
{"$rows_left_out":397}
{"sheet":"シール保証書（作成見本）","index":4,"n_rows":92,"n_cols":43,"rows_kept":92,"cut":false,"hidden":false,"merged":[[61,2,61,5],[61,8,61,14],[66,5,66,12],[90,2,91,2],[90,3,90,5],[90,6,91,6],[90,8,91,15],[0,27,3,37],[55,2,55,5],[55,8,55,25],[56,2,56,5],[56,8,56,25],[15,2,15,5],[15,8,15,14],[20,5,20,12],[44,2,45,2],[44,3,44,5],[44,6,45,6],[44,8,45,15],[12,2,12,5],[12,8,12,25],[13,2,13,5],[13,8,13,25],[58,2,58,5],[58,8,58,25],[59,2,59,5],[59,8,59,25],[60,2,60,5],[57,2,57,5],[57,8,57,25],[46,0,47,25],[49,17,49,24],[51,0,51,7],[52,9,52,10],[52,0,52,8],[14,2,14,5],[11,8,11,25],[0,0,1,25],[3,17,3,24],[5,0,5,7],[9,2,9,5],[9,8,9,25],[10,2,10,5],[10,8,10,25],[11,2,11,5],[6,9,6,10],[6,0,6,8]]}
["保　　証　　書",null,null,null,null,null,null,null,null,null,null,null,null,null,null,null,null,null,null,null,null,null,null,null,null,null,null,{"$f":"IF(入力シート!C16=\"\",\"\",\"宛名違い有り　　              　　　　　　　　　　　　　↓参照\")","v":""},null,null,null,null,null,null,null,null,null,null,null,null,null,1]
[null,null,null,null,null,null,null,null,null,null,null,null,null,null,null,null,null,null,null,null,null,null,null,null,null,null,null,null,null,null,null,null,null,null,null,null,null,null,null,null,null,1]
[null,null,null,null,null,null,null,null,null,null,null,null,null,null,null,null,null,null,null,null,null,null,null,null,null,null,null,null,null,null,null,null,null,null,null,null,null,null,null,null,null,1]
["　",null,null,null,null,null,null,null,null,null,null,null,null,null,null,null,null,{"$f":"IF(入力シート!C18=\"\",\"　　年　　 月　　 日\",入力シート!C18)","v":"　　年　　 月　　 日"},null,null,null,null,null,null,null,null,null,null,null,null,null,null,null,null,null,null,null,null,null,null,null,1]
[null,null,null,null,null,null,null,null,null,null,null,null,null,null,null,null,null,null,null,null,null,null,null,null,null,null,null,null,null,null,null,null,null,null,null,null,null,null,null,null,null,1]
[null,null,null,null,null,null,null,null,null,null,null,null,null,null,null,null,null,null,null,null,null,null,null,null,null,null,null,null,null,null,null,null,null,null,null,null,null,null,null,null,null,1]
[{"$f":"入力シート!C14","v":0},null,null,null,null,null,null,null,null,{"$f":"入力シート!D14","v":"御中"},null,null,null,null,null,null,null,null,null,null,null,null,null,null,null,null,null,null,null,null,null,null,null,null,null,null,null,null,null,null,null,1]
[null,null,null,null,null,null,null,null,null,null,null,null,null,null,null,null,null,null,null,null,null,null,null,null,null,null,null,null,null,null,null,null,null,null,null,null,null,null,null,null,null,1]
[null,null,null,null,null,null,null,null,null,null,null,null,null,null,null,null,null,null,null,null,null,null,null,null,null,null,null,null,null,null,null,null,null,null,null,null,null,null,null,null,null,1]
[null,null,"工事名称",null,null,null,null,"：",{"$f":"入力シート!C13","v":0},null,null,null,null,null,null,null,null,null,null,null,null,null,null,null,null,null,null,null,null,null,null,null,null,null,null,null,null,null,null,null,null,1]
[null,null,"現場住所",null,null,null,null,"：",{"$f":"入力シート!C19","v":0},null,null,null,null,null,null,null,null,null,null,null,null,null,null,null,null,null,null,null,null,null,null,null,null,null,null,null,null,null,null,null,null,1]
[null,null,"施工箇所",null,null,null,null,"：",{"$f":"入力シート!C20","v":0},null,null,null,null,null,null,null,null,null,null,null,null,null,null,null,null,null,null,null,null,null,null,null,null,null,null,null,null,null,null,null,null,1]
[null,null,"施工仕様・施工量",null,null,null,null,"：",{"$f":"入力シート!C21","v":0},null,null,null,null,null,null,null,null,null,null,null,null,null,null,null,null,null,null,null,null,null,null,null,null,null,null,null,null,null,null,null,null,1]
[null,null,"使用材料・使用量",null,null,null,null,"：",{"$f":"入力シート!C22","v":0},null,null,null,null,null,null,null,null,null,null,null,null,null,null,null,null,null,null,null,null,null,null,null,null,null,null,null,null,null,null,null,null,1]
[null,null,"保証内容",null,null,null,null,"：","防水機能の維持（漏水に至るはく離・破断を生じないこと）",null,null,null,null,null,null,null,null,null,null,null,null,null,null,null,null,null,null,null,null,null,null,null,null,null,null,null,null,null,null,null,null,1]
[null,null,"保証期間",null,null,null,null,"：",{"$f":"入力シート!C23","v":"00:00:00"},null,null,null,null,null,null,{"$f":"入力シート!C24","v":0},"年間",null,null,null,null,null,null,null,null,null,null,null,null,null,null,null,null,null,null,null,null,null,null,null,null,1]
[null,null,null,null,null,null,null,null,null,null,null,null,null,null,null,null,null,null,null,null,null,null,null,null,null,null,null,null,null,null,null,null,null,null,null,null,null,null,null,null,null,1]
[null,null,"　 上記シーリング工事に関し、防水保証期間内にシーリング材のはく離・破断が原因で、",null,null,null,null,null,null,null,null,null,null,null,null,null,null,null,null,null,null,null,null,null,null,null,null,null,null,null,null,null,null,null,null,null,null,null,null,null,null,1]
[null,null,"室内漏水事故が生じた場合、当事者が立会って原因を調査し、協議の上、当方に過失",null,null,null,null,null,null,null,null,null,null,null,null,null,null,null,null,null,null,null,null,null,null,null,null,null,null,null,null,null,null,null,null,null,null,null,null,null,null,1]
[null,null,"のある場合は該当箇所を補修いたします。",null,null,null,null,null,null,null,null,null,null,null,null,null,null,null,null,null,null,null,null,null,null,null,null,null,null,null,null,null,null,null,null,null,null,null,null,null,null,1]
{"$rows_left_out":73}
{"sheet":"エポ保証書（作成見本）","index":5,"n_rows":94,"n_cols":43,"rows_kept":94,"cut":false,"hidden":false,"merged":[[61,28,61,34],[66,5,66,12],[92,2,93,2],[92,3,92,5],[92,6,93,6],[92,8,93,15],[59,2,59,5],[59,8,59,25],[60,2,60,5],[60,8,60,25],[61,2,61,5],[61,8,61,14],[56,2,56,5],[56,8,56,25],[57,2,57,5],[57,8,57,25],[58,2,58,5],[58,8,58,25],[47,0,48,25],[50,17,50,24],[52,0,52,7],[53,11,53,12],[53,9,53,10],[53,0,53,8],[14,28,14,34],[19,5,19,12],[45,2,46,2],[45,3,45,5],[45,6,46,6],[45,8,46,15],[12,2,12,5],[12,8,12,25],[13,2,13,5],[13,8,13,25],[14,2,14,5],[14,8,14,14],[9,2,9,5],[9,8,9,25],[10,2,10,5],[10,8,10,25],[11,2,11,5],[11,8,11,25],[0,27,3,37],[0,0,1,25],[3,17,3,24],[5,0,5,7],[6,11,6,12],[6,9,6,10],[6,0,6,8]]}
["保　　証　　書",null,null,null,null,null,null,null,null,null,null,null,null,null,null,null,null,null,null,null,null,null,null,null,null,null,null,{"$f":"IF(入力シート!C30=\"\",\"\",\"宛名違い有り　　              　　　　　　　　　　　　　↓参照\")","v":""},null,null,null,null,null,null,null,null,null,null,null,null,null,1]
[null,null,null,null,null,null,null,null,null,null,null,null,null,null,null,null,null,null,null,null,null,null,null,null,null,null,null,null,null,null,null,null,null,null,null,null,null,null,null,null,null,1]
[null,null,null,null,null,null,null,null,null,null,null,null,null,null,null,null,null,null,null,null,null,null,null,null,null,null,null,null,null,null,null,null,null,null,null,null,null,null,null,null,null,1]
["　",null,null,null,null,null,null,null,null,null,null,null,null,null,null,null,"　",{"$f":"IF(入力シート!C32=\"\",\"　　年　　 月　　 日\",入力シート!C32)","v":"　　年　　 月　　 日"},null,null,null,null,null,null,null,null,null,null,null,null,null,null,null,null,null,null,null,null,null,null,null,1]
[null,null,null,null,null,null,null,null,null,null,null,null,null,null,null,null,null,null,null,null,null,null,null,null,null,null,null,null,null,null,null,null,null,null,null,null,null,null,null,null,null,1]
[null,null,null,null,null,null,null,null,null,null,null,null,null,null,null,null,null,null,null,null,null,null,null,null,null,null,null,null,null,null,null,null,null,null,null,null,null,null,null,null,null,1]
[{"$f":"入力シート!C28","v":0},null,null,null,null,null,null,null,null,{"$f":"入力シート!D28","v":"御中"},null,null,null,null,null,null,null,null,null,null,null,null,null,null,null,null,null,null,null,null,null,null,null,null,null,null,null,null,null,null,null,1]
[null,null,null,null,null,null,null,null,null,null,null,null,null,null,null,null,null,null,null,null,null,null,null,null,null,null,null,null,null,null,null,null,null,null,null,null,null,null,null,null,null,1]
[null,null,null,null,null,null,null,null,null,null,null,null,null,null,null,null,null,null,null,null,null,null,null,null,null,null,null,null,null,null,null,null,null,null,null,null,null,null,null,null,null,1]
[null,null,"工事名称",null,null,null,null,"：",{"$f":"入力シート!C27","v":""},null,null,null,null,null,null,null,null,null,null,null,null,null,null,null,null,null,null,null,null,null,null,null,null,null,null,null,null,null,null,null,null,1]
[null,null,"現場住所",null,null,null,null,"：",{"$f":"入力シート!C33","v":0},null,null,null,null,null,null,null,null,null,null,null,null,null,null,null,null,null,null,null,null,null,null,null,null,null,null,null,null,null,null,null,null,1]
[null,null,"施工箇所",null,null,null,null,"：",{"$f":"入力シート!C34","v":0},null,null,null,null,null,null,null,null,null,null,null,null,null,null,null,null,null,null,null,null,null,null,null,null,null,null,null,null,null,null,null,null,1]
[null,null,"施工仕様・施工量",null,null,null,null,"：",{"$f":"入力シート!C35","v":0},null,null,null,null,null,null,null,null,null,null,null,null,null,null,null,null,null,null,null,null,null,null,null,null,null,null,null,null,null,null,null,null,1]
[null,null,"使用材料・使用量",null,null,null,null,"：",{"$f":"入力シート!C36","v":0},null,null,null,null,null,null,null,null,null,null,null,null,null,null,null,null,null,null,null,null,null,null,null,null,null,null,null,null,null,null,null,null,1]
[null,null,"保証期間",null,null,null,null,"：",{"$f":"入力シート!C37","v":"00:00:00"},null,null,null,null,null,null,{"$f":"入力シート!C38","v":0},"年間",null,null,null,null,null,null,null,null,null,null,null,null,null,null,null,null,null,null,null,null,null,null,null,null,1]
[null,null,null,null,null,null,null,null,null,null,null,null,null,null,null,null,null,null,null,null,null,null,null,null,null,null,null,null,null,null,null,null,null,null,null,null,null,null,null,null,null,1]
[null,null,null,null,null,null,null,null,null,null,null,null,null,null,null,null,null,null,null,null,null,null,null,null,null,null,null,null,null,null,null,null,null,null,null,null,null,null,null,null,null,1]
[null,null,"　 上記工事に関し、保証期間内に施工箇所に欠陥等が生じた場合、当事者が立会って",null,null,null,null,null,null,null,null,null,null,null,null,null,null,null,null,null,null,null,null,null,null,null,null,null,null,null,null,null,null,null,null,null,null,null,null,null,null,1]
[null,null,"原因を調査し、協議の上、当方に過失のある場合は該当箇所を補修いたします。",null,null,null,null,null,null,null,null,null,null,null,null,null,null,null,null,null,null,null,null,null,null,null,null,null,null,null,null,null,null,null,null,null,null,null,null,null,null,1]
[null,null,"　 なお、施工は",null,null,{"$f":"入力シート!C29","v":0},null,null,null,null,null,null,null," 、材料に関しての欠陥はコニシ株式会社",null,null,null,null,null,null,null,null,null,null,null,null,null,null,null,null,null,null,null,null,null,null,null,null,null,null,null,1]
{"$rows_left_out":75}
{"sheet":"試験成績書(依頼書)","index":6,"n_rows":23,"n_cols":32,"rows_kept":23,"cut":false,"hidden":false,"merged":[[10,26,11,53],[13,31,13,35],[13,36,13,52],[12,1,20,6],[13,7,13,11],[13,12,13,30],[10,1,11,20],[16,12,16,52],[17,10,17,24],[17,7,17,9],[17,49,17,51],[19,7,19,11],[19,12,19,39],[17,25,17,27],[8,1,8,12],[8,13,8,24],[8,25,8,27],[10,21,11,25],[17,28,17,39],[3,39,8,53],[3,28,3,38],[4,28,4,38],[5,28,5,38],[6,28,6,38],[7,28,7,38],[8,28,8,38],[15,7,15,9],[15,10,15,11],[15,12,15,17],[15,19,15,52],[21,1,22,6],[21,7,21,9],[21,10,21,15],[21,16,21,27],[22,7,22,9],[22,10,22,15],[22,16,22,19],[22,22,22,23],[22,26,22,27],[3,1,3,12],[3,13,3,24],[3,25,3,27],[7,13,7,24],[7,25,7,27],[4,1,4,12],[4,13,4,24],[4,25,4,27],[5,1,5,12],[5,13,5,24],[5,25,5,27],[6,1,6,12],[6,13,6,24],[6,25,6,27],[7,1,7,12],[0,1,0,53],[2,1,2,12],[2,13,2,24],[2,25,2,27],[2,28,2,53]]}
[" ","試験成績書　依頼書"]
["． 依頼内容",null,null,null,null,null,null,"※一行に一製品名を記入してください。"]
[null,"製　　　品　　　名",null,null,null,null,null,null,null,null,null,null,null,"ロ　ッ　ト　番　号",null,null,null,null,null,null,null,null,null,null,null,"部数",null,null,"備　考"]
[]
[]
[]
[]
[]
[]
[]
[null,null,null,null,null,null,null,null,null,null,null,null,null,null,null,null,null,null,null,null,null,"発送方法",null,null,null,null,"メール・レターパック（ライト）"]
[]
[null,"送　付　先　（直送する場合は住所まで記入してください。）"]
[null,null,null,null,null,null,null,"（企業名）",null,null,null,null,null,null,null,null,null,null,null,null,null,null,null,null,null,null,null,null,null,null,null," (担当者）"]
[]
[null,null,null,null,null,null,null,"（住所）",null,null,"〒"]
[]
[null,null,null,null,null,null,null,null,null,null,null,null,null,null,null,null,null,null,null,null,null,null,null,null,null,"(Tel)"]
[]
[null,null,null,null,null,null,null,"(Eメール)"]
{"$rows_left_out":3}